program: Orca
programVersion: 5.0.2
elementType: O O O C C C C C C C C C C C C C C C C C C C H H H H H H H H H H H H H H H H H H H H H H H H
charge: 0
multiplicity: 1
keywords: wb97x-d3
keywords: def2-TZVPP
keywords: def2/J RIJCOSX
keywords: DEFGRID2
keywords: scfconv7
keywords: smallprint printgap noloewdin
keywords: NOSOSCF
formula: C19H24O3
InChI: InChI=1/C19H24O3/c1-7-8-13-12(4)16(10-15(13)20)22-18(21)17-14(9-11(2)3)19(17,5)6/h1,9,14,16-17H,8,10H2,2-6H3
46 atoms
O  0.073485 -0.63337 -0.13604
O  -0.215772 -2.33349 1.290269
O  3.935991 0.513206 -2.438182
C  -2.511336 0.427006 1.232907
C  -2.775316 -0.036314 -0.169003
C  -2.068628 -0.962035 0.797569
C  -1.512102 1.537392 1.446009
C  -3.646989 0.466532 2.225668
C  -4.133892 -0.396621 -0.631848
C  -0.659694 -1.381446 0.686164
C  -4.812902 0.196486 -1.618763
C  1.463751 -0.922083 -0.304941
C  -6.190226 -0.265007 -1.988472
C  -4.306791 1.353076 -2.425682
C  1.898679 -0.603061 -1.72773
C  2.318631 -0.03889 0.571342
C  3.284109 0.562237 -0.140332
C  3.159002 0.207018 -1.555583
C  2.108035 0.036275 2.03515
C  4.382082 1.444542 0.373196
C  5.441203 0.680136 1.021424
C  6.306171 0.050829 1.570013
H  -2.135003 0.426567 -0.912008
H  -2.677974 -1.759947 1.208885
H  -1.010508 1.436162 2.410448
H  -2.035124 2.495674 1.450298
H  -0.75119 1.589439 0.670673
H  -3.259684 0.457147 3.246203
H  -4.329982 -0.376035 2.124976
H  -4.227913 1.382723 2.101589
H  -4.616646 -1.215544 -0.105897
H  1.657462 -1.969095 -0.062428
H  1.155144 0.011249 -2.241559
H  2.072156 -1.489682 -2.336938
H  -6.517682 -1.112554 -1.38661
H  -6.919419 0.539825 -1.863932
H  -6.23496 -0.560087 -3.040077
H  -4.291616 1.105123 -3.48981
H  -4.978224 2.209235 -2.321483
H  -3.308776 1.683384 -2.144491
H  2.215006 -0.953671 2.483438
H  1.100492 0.383459 2.271942
H  2.814965 0.707425 2.518178
H  4.807876 2.021539 -0.450512
H  3.98139 2.173505 1.081414
H  7.065375 -0.527281 2.047255
elementType: O C H
totalener: -964.16148338 hartree
nucrepener: 1767.74704452 hartree
electener: -2731.90852789 hartree
oneelecener: -4819.61159038 hartree
twoeener: 2087.70306249 hartree
cpcmener: -0.04089038 hartree
kineticenergy: 959.76315437 hartree
xcener: -94.697953544409 hartree
chargesum: -0.0000000
charge: -0.278090 -0.495249 -0.480757 0.145523 0.058066 -0.154696 -0.320509 -0.267543 -0.305693 0.430831 -0.036882 0.209648 -0.224868 -0.252434 -0.131080 -0.018838 -0.092592 0.316315 -0.249287 -0.115278 -0.460353 0.047712 0.105340 0.091488 0.103799 0.105748 0.095522 0.098677 0.089600 0.095623 0.123004 0.113281 0.107115 0.100411 0.089297 0.094386 0.093570 0.096523 0.096768 0.088015 0.120463 0.124430 0.101409 0.114482 0.135524 0.291575
qa: -0.2781 -0.4952 -0.4808 0.1455 0.0581 -0.1547 -0.3205 -0.2675 -0.3057 0.4308 -0.0369 0.2096 -0.2249 -0.2524 -0.1311 -0.0188 -0.0926 0.3163 -0.2493 -0.1153 -0.4604 0.0477 0.1053 0.0915 0.1038 0.1057 0.0955 0.0987 0.0896 0.0956 0.1230 0.1133 0.1071 0.1004 0.0893 0.0944 0.0936 0.0965 0.0968 0.0880 0.1205 0.1244 0.1014 0.1145 0.1355 0.2916
va: 2.1207 1.9974 2.0173 3.6402 3.7363 3.9220 3.9097 3.9056 3.8558 4.1416 3.7371 3.7727 3.9235 3.9452 3.9335 3.7288 3.5121 4.0393 3.9414 3.8835 3.8252 3.5302 1.0170 1.0360 0.9943 1.0030 1.0118 1.0020 1.0048 1.0030 1.0086 1.0305 1.0237 1.0239 1.0084 0.9960 0.9961 0.9972 0.9972 1.0098 1.0031 0.9935 1.0041 1.0159 0.9890 0.9438
dispcorr: -0.022404549 hartree
energy: -964.183887924662
dipole: -28.70765 26.66769 -2.03996 8.25440 -7.24601 1.00839 3.07479 -2.12354 0.95125
magnitude: 2.46640 au
magnitude: 6.26910 debye
