program: Gaussian 09
title: 000071714
version: EM64L-G09RevD.01
frameworkgroup: C1[X(C21H26O3)]
method: RPBEPBE
basis: SDD
operation: Freq
keyword: #pfreq=noraman
keyword: PBEPBE/SDD
title: #p freq=noraman PBEPBE/SDD
converged: NO YES NO NO
title: Mulliken charges:
elementType: O O O C C C C C C C C C C C C C C C C C C C C C H H H H H H H H H H H H H H H H H H H H H H H H H H
charge: -0.445172 -0.293250 -0.440176 0.300099 -0.219163 -0.106335 -0.292591 0.123587 -0.549231 -0.500639 -0.058266 -0.598783 -0.491614 -0.757086 0.288894 -0.578854 0.321291 0.280206 -0.366300 -0.543209 -0.510829 -0.432499 0.282317 -0.555640 0.196895 0.203234 0.232577 0.233790 0.224317 0.238189 0.222206 0.210270 0.247233 0.250934 0.217977 0.201855 0.237752 0.201823 0.222468 0.226355 0.223082 0.335562 0.267002 0.254375 0.231864 0.206052 0.204786 0.216961 0.284190 0.351493
chargesum: 0.00000
title: Mulliken charges with hydrogens summed into heavy atoms:
elementType: O O O C C C C C C C C C C C C C C C C C C C C C
charge: -0.109609 -0.293250 -0.088682 0.300099 -0.022268 0.096898 -0.060013 0.123587 -0.091124 -0.040244 0.152004 -0.100616 -0.071782 -0.095044 0.288894 -0.129417 0.321291 0.280206 -0.099298 -0.288834 0.131872 -0.215538 0.282317 -0.271450
polarizability: 2.93568279e+02 -8.36603561e+00 2.20664564e+02 2.21678985e+00 1.07930232e+01 1.65985326e+02
1716.lowfreq: -11.6912 -0.0008 -0.0005 -0.0004 3.6981 8.8527 34.9758 44.9213 62.4971
frequency: 34.9635 44.8692 62.4947 66.1409 83.6524 90.7108 109.8425 145.8738 153.8583 161.3786 166.6045 176.5740 186.6118 212.2485 224.8578 233.4175 236.2108 250.8245 277.6878 316.3299 321.8481 340.2872 349.1375 353.0432 381.9085 384.8377 407.0900 413.0639 429.4689 451.1956 465.5139 477.3499 498.6460 511.7942 554.5746 565.2560 569.6232 590.6796 594.4436 612.0031 637.2503 663.0777 684.2754 711.5084 720.4394 722.5997 772.1751 784.5451 805.6531 815.4261 856.6826 869.6447 875.3156 884.5976 897.8058 922.5216 932.1300 938.4706 942.4186 970.4475 979.8624 993.4649 1012.7643 1022.4494 1030.2278 1041.2305 1047.7648 1058.0506 1074.6210 1091.9285 1104.9558 1114.4844 1118.6911 1123.3522 1142.6770 1145.5008 1148.8320 1155.7850 1172.9545 1179.5822 1197.2669 1200.7045 1219.6141 1231.4597 1237.1665 1245.2916 1261.2584 1266.2346 1267.5462 1279.0204 1286.5257 1295.2968 1299.6827 1315.2664 1322.7593 1329.4803 1336.6123 1338.5082 1349.2799 1361.5838 1367.8518 1388.8127 1396.2694 1435.3186 1445.4647 1456.0226 1458.8360 1460.0870 1464.1429 1473.5360 1475.8039 1477.5178 1481.7490 1488.5329 1492.8243 1588.1144 1630.7327 2145.5343 2929.3999 2933.0800 2940.7266 2947.7558 2955.2708 2969.6668 2986.9478 2990.2821 2991.6178 3002.7336 3010.9211 3020.3336 3028.1062 3047.7577 3049.4290 3052.5258 3078.3538 3085.8582 3094.5943 3097.1300 3111.6665 3141.9776 3167.4984 3430.2311 3541.6724 3582.6317
redmass: 5.0299 3.0318 3.7809 3.7220 1.9521 3.1217 3.5839 2.1890 1.4015 2.9907 2.1832 3.6773 2.9875 3.1056 2.4235 1.2093 3.2450 2.7314 3.6984 4.1789 3.3024 3.2834 1.1127 4.0998 3.7653 2.9545 3.5795 3.8879 3.4128 4.0281 3.7365 3.6057 4.2105 4.0567 3.6635 3.3526 5.0703 3.5386 4.9351 3.3741 1.2400 1.2621 4.7062 2.9609 5.0402 2.5631 2.4912 1.8299 1.7729 1.9371 1.9153 2.2920 3.0379 1.8157 2.7817 2.6766 1.4409 2.8704 2.4919 2.5941 2.0312 2.7710 1.9703 2.0863 2.6447 2.8931 4.7437 2.4426 2.0582 2.5479 1.6035 1.3389 1.7551 2.1822 2.0180 1.4495 1.4047 1.8356 1.5129 1.4001 1.9197 1.8032 1.5803 1.2927 1.6371 1.7583 1.4821 2.0981 1.5338 1.2957 1.2682 1.3533 1.3710 1.4157 1.4638 1.5935 1.8035 1.4686 1.3402 1.5200 1.4622 5.3551 1.2010 1.1386 2.9637 1.0797 1.1539 1.0615 1.0693 1.0730 1.0560 1.0765 1.0550 1.0878 2.7311 7.1184 6.5154 6.0577 1.0831 1.0344 1.0825 1.0807 1.0650 1.0838 1.0564 1.0514 1.0514 1.0600 1.1024 1.0941 1.0621 1.1017 1.1012 1.1038 1.0967 1.1037 1.0980 1.0990 1.0901 1.0916 1.0939 1.1598 1.0654 1.0659
irintensity: 0.1293 1.5940 0.8002 0.2309 4.1114 1.9459 0.5766 1.1723 4.4849 3.1938 4.6434 5.4208 2.8413 7.7605 22.3964 112.9059 5.5849 1.3371 1.0642 2.6689 1.2586 2.0221 136.5201 4.2417 3.6104 2.3911 8.0544 5.4852 2.7731 0.5355 2.9641 7.7477 2.4705 1.6569 2.7849 8.3741 3.5589 9.4062 0.1616 0.7703 67.8748 57.7491 12.2057 3.2962 0.2190 7.2715 2.4820 22.8074 17.4878 4.1971 14.3846 7.1980 9.2564 9.3021 82.3605 7.8157 3.9296 11.0530 12.5438 9.4535 2.6555 19.0093 7.0386 9.1876 31.3608 30.6049 75.3842 52.7115 9.4064 8.6033 0.8711 9.8827 110.8036 4.4774 6.3947 12.1661 59.8488 13.0259 29.8845 21.7907 0.5766 16.0466 3.6701 6.4642 4.4015 29.4671 6.6961 31.6757 9.4007 1.9488 7.1075 1.1545 2.3345 2.0516 6.9960 20.3158 31.7922 11.8866 11.4983 0.3043 1.9914 9.2768 20.5918 5.2534 4.1682 1.6067 8.2520 6.0379 12.3326 5.8336 16.7860 1.2566 3.7198 21.6650 97.8498 32.7118 58.1335 1.4248 35.1484 68.5680 33.2863 15.2504 28.0829 33.8644 25.7072 51.7855 14.5743 32.4755 66.4622 32.8332 26.8717 4.4335 71.3124 11.8818 26.8902 27.9025 35.7742 27.6931 23.2983 9.0203 4.9447 68.2023 8.4443 37.3322
temp: 298.150 k
press: 1.00000 atm
elementType: 8 8 8 6 6 6 6 6 6 6 6 6 6 6 6 6 6 6 6 6 6 6 6 6 1 1 1 1 1 1 1 1 1 1 1 1 1 1 1 1 1 1 1 1 1 1 1 1 1 1
symmnumber: 1
zpe: 1098345.1 jmol-1
zpe.correction: 0.418338 hartree
zpe.thermalcorrener: 0.441522 hartree
zpe.thermalcorrenthalpy: 0.442467 hartree
zpe.thermalcorrgfe: 0.367593 hartree
zpe.sumelectzpe: -1039.625131 hartree
zpe.sumelectthermal: -1039.601946 hartree
zpe.sumelectthermalent: -1039.601002 hartree
zpe.sumelectthermalfe: -1039.675876 hartree
dipole: 0.5694 0.7458 0.7142
dipole: 1.1792
quadrupole: -159.4385 -128.1783 -142.0056
quadrupole: 6.1517 -0.2024 -2.7248
quadrupole: -16.2310 15.0291 1.2019 6.1517 -0.2024 -2.7248
hfenergy: -1040.0434689 hartree
pointgroup: C01 [X(C21H26O3)]
dipole: -0.2144652 -0.3037044 0.2774793 debye
polarizability: 294.1554745|-5.2289055|220.2018155|-0.5446063|-10.6703048|165.8608786 unknown
InChI: InChI=1S/C21H26O3/c1-4-21(23)10-9-17-16-7-5-13-11-14(22)6-8-15(13)19(16)18(24-3)12-20(17,21)2/h1,6,8,11,16-19,22-23H,5,7,9-10,12H2,2-3H3
charge 0 multiplicity 1
50 atoms
O  4.492508 1.610732 -0.286719
O  -0.346881 -2.433093 0.094308
O  -6.33208 -0.256477 -0.126355
C  2.319387 0.325157 -0.4134
C  1.539042 1.440801 0.362496
C  -0.01036 1.378625 0.27623
C  -0.585431 -0.047689 0.544977
C  3.755126 0.429771 0.256757
C  1.683389 -1.057652 -0.093254
C  2.068814 1.355468 1.833644
C  0.15552 -1.107324 -0.320693
C  3.461637 0.655323 1.773337
C  -0.586092 1.950613 -1.044479
C  2.426237 0.531054 -1.941419
C  -2.108574 -0.082652 0.363567
C  -2.107262 2.153592 -0.918417
C  -2.818174 0.930773 -0.346453
C  4.626083 -0.72035 -0.020779
C  -2.850162 -1.152292 0.928696
C  -4.222727 0.836776 -0.493397
C  -0.161591 -3.475581 -0.912536
C  -4.249092 -1.245135 0.790363
C  -4.935279 -0.240864 0.066496
C  5.345387 -1.692101 -0.251801
H  1.838681 2.423719 -0.064357
H  -0.395822 2.035872 1.087316
H  -0.365917 -0.329803 1.59601
H  1.852295 -1.334177 0.965488
H  2.181657 -1.83198 -0.706084
H  1.372371 0.766462 2.457119
H  2.123285 2.361026 2.288486
H  -0.093286 -0.956572 -1.394526
H  4.277745 1.254365 2.21316
H  3.44638 -0.30832 2.309638
H  -0.372862 1.272741 -1.891155
H  -0.098327 2.917155 -1.278224
H  3.179997 -0.160704 -2.361141
H  1.467919 0.333062 -2.450504
H  2.747976 1.556045 -2.191054
H  -2.546749 2.418047 -1.899221
H  -2.300836 3.019396 -0.250295
H  4.020807 2.427785 0.021526
H  -2.308949 -1.933382 1.469509
H  -4.779059 1.606573 -1.039494
H  -0.65362 -4.376613 -0.511718
H  0.909785 -3.700202 -1.094236
H  -0.640203 -3.193862 -1.874072
H  -4.794971 -2.086488 1.237591
H  5.98233 -2.534567 -0.447454
H  -6.732152 -1.05165 0.305121
