program: Orca
programVersion: 5.0.2
elementType: O O O C C C C C C C C C C C C C C C C C C C H H H H H H H H H H H H H H H H H H H H H H H H
charge: 0
multiplicity: 1
keywords: wb97x-d3
keywords: def2-TZVPP
keywords: def2/J RIJCOSX
keywords: DEFGRID2
keywords: scfconv7
keywords: smallprint printgap noloewdin
keywords: NOSOSCF
formula: C19H24O3
InChI: InChI=1/C19H24O3/c1-7-8-13-12(4)16(10-15(13)20)22-18(21)17-14(9-11(2)3)19(17,5)6/h1,9,14,16-17H,8,10H2,2-6H3
46 atoms
O  -0.638673 0.058006 1.124527
O  -1.759297 -1.519088 2.233027
O  3.232168 -2.088139 0.093556
C  -3.258728 0.950507 -0.118268
C  -2.664167 -0.089022 -1.00808
C  -2.867254 -0.382551 0.48444
C  -2.520971 2.227311 0.20291
C  -4.751775 1.167797 -0.227216
C  -1.319383 0.045789 -1.621641
C  -1.729205 -0.670409 1.381089
C  -0.624527 -0.950268 -2.173617
C  0.577425 -0.33897 1.751554
C  0.709993 -0.708331 -2.81178
C  -1.097153 -2.372363 -2.195432
C  1.125156 -1.666725 1.232055
C  1.605295 0.690574 1.355403
C  2.640648 0.141465 0.711439
C  2.45568 -1.316218 0.596355
C  1.398396 2.12682 1.670587
C  3.842079 0.829915 0.13689
C  3.486908 1.806726 -0.884472
C  3.179593 2.614533 -1.717162
H  -3.381634 -0.619802 -1.627932
H  -3.698675 -1.037317 0.718266
H  -2.767884 2.986963 -0.541089
H  -2.831291 2.610401 1.176598
H  -1.441539 2.120829 0.220027
H  -5.161043 1.551781 0.708841
H  -4.97728 1.891685 -1.0123
H  -5.283594 0.246301 -0.466991
H  -0.884833 1.039462 -1.644652
H  0.441205 -0.35341 2.837846
H  0.473929 -2.119066 0.482394
H  1.257599 -2.40632 2.021847
H  1.018426 0.334134 -2.741187
H  1.487526 -1.315896 -2.341579
H  0.697707 -0.987921 -3.868458
H  -1.995056 -2.534115 -1.601208
H  -1.305297 -2.699423 -3.217909
H  -0.322065 -3.042361 -1.813721
H  0.994455 2.253901 2.676348
H  0.678212 2.568887 0.979411
H  2.3181 2.702672 1.588662
H  4.413809 1.324798 0.928011
H  4.505947 0.076489 -0.294248
H  2.917944 3.326878 -2.461772
totalener: -964.14224354 hartree
nucrepener: 1894.96033433 hartree
electener: -2859.10257788 hartree
oneelecener: -5074.51006343 hartree
twoeener: 2215.40748556 hartree
kineticenergy: 959.82822679 hartree
xcener: -94.700353101531 hartree
chargesum: 0.0000000
charge: -0.266343 -0.355797 -0.332136 0.140932 -0.047318 -0.112358 -0.253393 -0.248914 -0.142537 0.310558 -0.079900 0.201907 -0.203321 -0.253944 -0.114501 -0.028740 -0.047169 0.184604 -0.272940 -0.134321 -0.403479 0.061074 0.095346 0.087067 0.093694 0.096201 0.048253 0.092577 0.088092 0.073710 0.087846 0.096386 0.085414 0.104751 0.073748 0.084922 0.097609 0.089432 0.103493 0.087358 0.105402 0.120168 0.101066 0.119303 0.120605 0.245595
qa: -0.2663 -0.3558 -0.3321 0.1409 -0.0473 -0.1124 -0.2534 -0.2489 -0.1425 0.3106 -0.0799 0.2019 -0.2033 -0.2539 -0.1145 -0.0287 -0.0472 0.1846 -0.2729 -0.1343 -0.4035 0.0611 0.0953 0.0871 0.0937 0.0962 0.0483 0.0926 0.0881 0.0737 0.0878 0.0964 0.0854 0.1048 0.0737 0.0849 0.0976 0.0894 0.1035 0.0874 0.1054 0.1202 0.1011 0.1193 0.1206 0.2456
va: 2.0755 2.1532 2.1577 3.7494 3.8079 3.8491 3.9089 3.9118 3.8197 4.2448 3.7622 3.8013 3.9321 3.9391 3.8682 3.6971 3.4705 4.0702 3.9704 3.8901 3.8589 3.6148 1.0044 1.0277 1.0024 1.0043 1.0236 1.0037 1.0041 1.0081 1.0100 1.0155 1.0317 1.0253 1.0127 1.0075 1.0016 1.0057 0.9999 1.0007 1.0037 0.9893 1.0018 0.9865 1.0202 0.9738
dispcorr: -0.027411838 hartree
energy: -964.169655382408
dipole: -12.23835 11.61632 -0.62204 7.33816 -5.92563 1.41254 -9.19410 9.11504 -0.07907
magnitude: 1.54546 au
magnitude: 3.92824 debye
