program: Orca
programVersion: 5.0.2
elementType: O O O C C C C C C C C C C C C C C C C C C C H H H H H H H H H H H H H H H H H H H H H H H H
charge: 0
multiplicity: 1
keywords: wb97x-d3
keywords: def2-TZVPP
keywords: def2/J RIJCOSX
keywords: DEFGRID2
keywords: scfconv7
keywords: smallprint printgap noloewdin
keywords: NOSOSCF
formula: C19H24O3
InChI: InChI=1/C19H24O3/c1-7-8-13-12(4)16(10-15(13)20)22-18(21)17-14(9-11(2)3)19(17,5)6/h1,9,14,16-17H,8,10H2,2-6H3
46 atoms
O  -0.123803 -0.522955 1.225905
O  -1.126207 1.331299 0.47164
O  3.983715 -1.014959 3.242365
C  -3.683874 -0.416602 0.245185
C  -2.959174 -0.717204 -1.029879
C  -2.221953 -0.802326 0.311307
C  -4.152542 0.983558 0.556325
C  -4.640101 -1.473642 0.748093
C  -2.641286 0.307854 -2.039591
C  -1.141285 0.142308 0.658475
C  -2.738878 0.165828 -3.364692
C  1.037145 0.204691 1.624389
C  -2.379799 1.301703 -4.27663
C  -3.196131 -1.071311 -4.077384
C  1.655242 -0.438973 2.858133
C  2.113543 0.135078 0.565606
C  3.276051 -0.29198 1.074959
C  3.115486 -0.63575 2.49942
C  1.8349 0.558532 -0.829818
C  4.599957 -0.438354 0.384026
C  5.102397 0.812739 -0.168862
C  5.511072 1.842804 -0.629352
H  -3.160679 -1.702512 -1.4346
H  -2.023974 -1.813017 0.648636
H  -4.253666 1.118376 1.634505
H  -3.493287 1.76318 0.190516
H  -5.13632 1.139804 0.110717
H  -4.298443 -2.482745 0.512991
H  -4.759222 -1.408499 1.831086
H  -5.625093 -1.344674 0.296182
H  -2.298867 1.265611 -1.668583
H  0.770469 1.249846 1.802425
H  1.201586 -1.410597 3.063673
H  1.55469 0.162778 3.761506
H  -2.042674 2.179037 -3.726417
H  -1.583994 1.013549 -4.968511
H  -3.23296 1.598379 -4.892033
H  -2.41759 -1.437811 -4.750796
H  -3.470407 -1.889133 -3.415494
H  -4.065558 -0.85248 -4.701853
H  2.727463 0.538577 -1.450536
H  1.425892 1.569679 -0.848655
H  1.084066 -0.088109 -1.289333
H  5.324947 -0.830558 1.101761
H  4.528781 -1.182508 -0.41489
H  5.878259 2.75714 -1.028429
totalener: -964.14813846 hartree
nucrepener: 1763.69460386 hartree
electener: -2727.84274232 hartree
oneelecener: -4811.99000445 hartree
twoeener: 2084.14726213 hartree
kineticenergy: 959.81453478 hartree
xcener: -94.699120262118 hartree
chargesum: -0.0000000
charge: -0.277930 -0.396633 -0.330601 0.090514 0.045087 -0.088963 -0.253855 -0.238834 -0.247994 0.328204 -0.046080 0.221886 -0.203871 -0.241482 -0.138986 -0.055780 -0.061496 0.222158 -0.228999 -0.155365 -0.423572 0.102062 0.087887 0.082661 0.086442 0.103205 0.086686 0.070563 0.089368 0.090325 0.110641 0.100187 0.090943 0.087320 0.081305 0.082026 0.084058 0.087680 0.077745 0.087501 0.095490 0.114459 0.101426 0.117758 0.120391 0.244460
qa: -0.2779 -0.3966 -0.3306 0.0905 0.0451 -0.0890 -0.2539 -0.2388 -0.2480 0.3282 -0.0461 0.2219 -0.2039 -0.2415 -0.1390 -0.0558 -0.0615 0.2222 -0.2290 -0.1554 -0.4236 0.1021 0.0879 0.0827 0.0864 0.1032 0.0867 0.0706 0.0894 0.0903 0.1106 0.1002 0.0909 0.0873 0.0813 0.0820 0.0841 0.0877 0.0777 0.0875 0.0955 0.1145 0.1014 0.1178 0.1204 0.2445
va: 2.1229 2.0863 2.1728 3.7418 3.7764 3.8841 3.9192 3.9075 3.8970 4.1724 3.8041 3.7706 3.9377 3.9468 3.8761 3.7279 3.4948 4.1099 3.9449 3.9012 3.8685 3.5647 1.0087 1.0305 1.0023 1.0190 1.0022 1.0082 1.0051 1.0039 1.0244 1.0273 1.0314 1.0285 1.0124 0.9982 0.9985 0.9990 1.0168 0.9997 1.0091 1.0079 1.0045 1.0199 0.9849 0.9733
dispcorr: -0.021431142 hartree
energy: -964.169569602034
dipole: -25.48583 24.16796 -1.31786 0.01804 -0.31530 -0.29727 -18.38688 17.32769 -1.05919
magnitude: 1.71669 au
magnitude: 4.36347 debye
