program: Orca
programVersion: 5.0.2
elementType: O O O C C C C C C C C C C C C C C C C C C C H H H H H H H H H H H H H H H H H H H H H H H H
charge: 0
multiplicity: 1
keywords: wb97x-d3
keywords: def2-TZVPP
keywords: def2/J RIJCOSX
keywords: DEFGRID2
keywords: scfconv7
keywords: smallprint printgap noloewdin
keywords: NOSOSCF
formula: C19H24O3
InChI: InChI=1/C19H24O3/c1-7-8-13-12(4)16(10-15(13)20)22-18(21)17-14(9-11(2)3)19(17,5)6/h1,9,14,16-17H,8,10H2,2-6H3
46 atoms
O  -0.509007 -0.22441 0.43071
O  -1.396223 -0.376907 2.480584
O  3.631189 -0.949222 -1.265278
C  -3.161144 1.051081 -0.383011
C  -3.174258 -0.384334 -0.788736
C  -2.842992 -0.010147 0.654346
C  -2.10105 1.994482 -0.898068
C  -4.49856 1.732686 -0.201926
C  -2.195056 -0.966501 -1.741317
C  -1.527128 -0.217695 1.295548
C  -1.919175 -2.265953 -1.854457
C  0.810481 -0.497359 0.897448
C  -0.968149 -2.775468 -2.895004
C  -2.508337 -3.313082 -0.959994
C  1.539929 -1.383586 -0.105656
C  1.613847 0.779314 0.953489
C  2.717646 0.704278 0.200002
C  2.770109 -0.590679 -0.503962
C  1.152589 1.92015 1.783899
C  3.792676 1.735322 0.017541
C  4.473468 2.076868 1.259668
C  5.025201 2.36116 2.286707
H  -4.168106 -0.817447 -0.871131
H  -3.635243 -0.187525 1.37251
H  -2.43333 2.43927 -1.838027
H  -1.946367 2.812165 -0.191137
H  -1.139207 1.524028 -1.077926
H  -4.855528 2.135896 -1.151344
H  -5.259847 1.047052 0.171909
H  -4.423505 2.560697 0.504992
H  -1.704334 -0.277506 -2.421543
H  0.760083 -0.949075 1.891216
H  0.922047 -1.585933 -0.982073
H  1.833861 -2.347369 0.312248
H  -1.462935 -3.478206 -3.570089
H  -0.549292 -1.971703 -3.49936
H  -0.137924 -3.321776 -2.43898
H  -3.156693 -2.900861 -0.189387
H  -3.087936 -4.039775 -1.535065
H  -1.718008 -3.877308 -0.458182
H  0.871749 1.583392 2.782792
H  0.259363 2.372126 1.345561
H  1.910913 2.693719 1.88113
H  4.522787 1.354057 -0.700791
H  3.374266 2.643942 -0.425354
H  5.520923 2.603904 3.195303
totalener: -964.14246930 hartree
nucrepener: 1841.57718714 hartree
electener: -2805.71965643 hartree
oneelecener: -4967.57278789 hartree
twoeener: 2161.85313146 hartree
kineticenergy: 959.82829437 hartree
xcener: -94.700910173965 hartree
chargesum: 0.0000000
charge: -0.255760 -0.364503 -0.330194 0.142174 -0.044892 -0.140143 -0.317749 -0.244009 -0.154791 0.349768 -0.057677 0.167479 -0.226218 -0.247658 -0.116754 -0.044832 -0.061940 0.223916 -0.232817 -0.160114 -0.423682 0.103649 0.098942 0.089314 0.101692 0.093941 0.091063 0.087917 0.072924 0.092672 0.092508 0.107552 0.076053 0.093668 0.100873 0.089941 0.081424 0.085986 0.097162 0.086511 0.115342 0.099575 0.097422 0.118749 0.119836 0.245681
qa: -0.2558 -0.3645 -0.3302 0.1422 -0.0449 -0.1401 -0.3177 -0.2440 -0.1548 0.3498 -0.0577 0.1675 -0.2262 -0.2477 -0.1168 -0.0448 -0.0619 0.2239 -0.2328 -0.1601 -0.4237 0.1036 0.0989 0.0893 0.1017 0.0939 0.0911 0.0879 0.0729 0.0927 0.0925 0.1076 0.0761 0.0937 0.1009 0.0899 0.0814 0.0860 0.0972 0.0865 0.1153 0.0996 0.0974 0.1187 0.1198 0.2457
va: 2.0649 2.1394 2.1768 3.7106 3.8177 3.8591 3.9167 3.9105 3.8367 4.2116 3.7469 3.7940 3.9264 3.9507 3.8489 3.6734 3.4849 4.1364 3.9431 3.9058 3.8672 3.5614 1.0064 1.0276 1.0036 1.0003 1.0120 1.0041 1.0087 1.0038 1.0083 1.0321 1.0472 1.0258 0.9996 1.0076 0.9976 1.0081 1.0008 1.0006 1.0092 1.0010 1.0119 1.0190 0.9855 0.9726
dispcorr: -0.024986283 hartree
energy: -964.167455579638
dipole: -18.13903 16.93399 -1.20504 0.09424 0.39535 0.48959 -7.87356 7.68365 -0.18991
magnitude: 1.31449 au
magnitude: 3.34117 debye
