program: Orca
programVersion: 5.0.2
elementType: O O O C C C C C C C C C C C C C C C C C C C H H H H H H H H H H H H H H H H H H H H H H H H
charge: 0
multiplicity: 1
keywords: wb97x-d3
keywords: def2-TZVPP
keywords: def2/J RIJCOSX
keywords: DEFGRID2
keywords: scfconv7
keywords: smallprint printgap noloewdin
keywords: NOSOSCF
formula: C19H24O3
InChI: InChI=1/C19H24O3/c1-7-8-13-12(4)16(10-15(13)20)22-18(21)17-14(9-11(2)3)19(17,5)6/h1,9,14,16-17H,8,10H2,2-6H3
46 atoms
O  -0.096192 -0.711926 1.154842
O  -1.347078 1.145317 1.099134
O  4.100345 -1.351962 2.945599
C  -3.634863 -0.671466 0.054194
C  -2.822764 -0.398976 -1.172741
C  -2.140981 -0.895339 0.109859
C  -4.3041 0.444882 0.817775
C  -4.461138 -1.937862 0.041036
C  -2.594391 0.95293 -1.710558
C  -1.200075 -0.019619 0.835489
C  -2.373555 1.263517 -2.991507
C  0.975782 -0.035924 1.80886
C  -2.184491 2.693523 -3.403921
C  -2.294017 0.28391 -4.122928
C  1.703993 -0.993597 2.743076
C  2.020491 0.406546 0.810497
C  3.239307 -0.032156 1.14835
C  3.166852 -0.86495 2.361686
C  1.654017 1.252627 -0.353274
C  4.544945 0.233844 0.459786
C  4.595675 -0.304994 -0.89292
C  4.630288 -0.743324 -2.009267
H  -2.876487 -1.179646 -1.922807
H  -1.821162 -1.930239 0.077009
H  -5.272894 0.661458 0.364615
H  -4.48447 0.138157 1.849428
H  -3.733535 1.366592 0.849915
H  -4.631256 -2.304304 1.054944
H  -5.435295 -1.753025 -0.414901
H  -3.979452 -2.73764 -0.523233
H  -2.61708 1.770371 -1.001109
H  0.587071 0.835293 2.342871
H  1.381785 -2.023433 2.576565
H  1.553506 -0.773341 3.799979
H  -2.252762 3.377203 -2.559023
H  -1.210306 2.840303 -3.877254
H  -2.935282 2.992832 -4.139868
H  -1.346955 0.392705 -4.65698
H  -2.376254 -0.756352 -3.816657
H  -3.083639 0.47567 -4.853971
H  2.527621 1.583272 -0.910587
H  1.082836 2.125278 -0.03394
H  1.015617 0.69972 -1.045985
H  4.74143 1.309588 0.42616
H  5.349826 -0.205019 1.054711
H  4.663154 -1.144792 -2.992973
totalener: -964.14789774 hartree
nucrepener: 1779.53504339 hartree
electener: -2743.68294113 hartree
oneelecener: -4843.69280458 hartree
twoeener: 2100.00986345 hartree
kineticenergy: 959.82169050 hartree
xcener: -94.700072922619 hartree
chargesum: 0.0000000
charge: -0.276834 -0.395807 -0.330144 0.096596 0.040843 -0.078179 -0.258764 -0.241084 -0.237828 0.325189 -0.050704 0.216357 -0.203167 -0.242936 -0.133650 -0.048021 -0.056949 0.218457 -0.234348 -0.160333 -0.418970 0.096441 0.084814 0.082085 0.087763 0.085642 0.103214 0.089929 0.090930 0.070392 0.103746 0.097197 0.091155 0.087376 0.081042 0.082216 0.084608 0.085095 0.079804 0.090572 0.093682 0.118221 0.101719 0.119262 0.119274 0.244101
qa: -0.2768 -0.3958 -0.3301 0.0966 0.0408 -0.0782 -0.2588 -0.2411 -0.2378 0.3252 -0.0507 0.2164 -0.2032 -0.2429 -0.1337 -0.0480 -0.0569 0.2185 -0.2343 -0.1603 -0.4190 0.0964 0.0848 0.0821 0.0878 0.0856 0.1032 0.0899 0.0909 0.0704 0.1037 0.0972 0.0912 0.0874 0.0810 0.0822 0.0846 0.0851 0.0798 0.0906 0.0937 0.1182 0.1017 0.1193 0.1193 0.2441
va: 2.1212 2.0884 2.1732 3.7473 3.7722 3.8533 3.9128 3.9053 3.9056 4.1820 3.8101 3.7894 3.9352 3.9470 3.8729 3.7177 3.4867 4.1124 3.9493 3.9140 3.8675 3.5700 1.0077 1.0312 1.0009 1.0024 1.0209 1.0051 1.0039 1.0081 1.0244 1.0280 1.0318 1.0278 1.0125 0.9990 0.9983 1.0000 1.0154 0.9986 1.0062 1.0087 1.0038 0.9850 1.0198 0.9736
dispcorr: -0.021773431 hartree
energy: -964.169671171710
dipole: -23.51382 22.29772 -1.21610 5.48703 -5.27782 0.20921 -17.06868 16.08072 -0.98796
magnitude: 1.58074 au
magnitude: 4.01792 debye
