program: Orca
programVersion: 5.0.2
elementType: O O O C C C C C C C C C C C C C C C C C C C H H H H H H H H H H H H H H H H H H H H H H H H
charge: 0
multiplicity: 1
keywords: wb97x-d3
keywords: def2-TZVPP
keywords: def2/J RIJCOSX
keywords: DEFGRID2
keywords: scfconv7
keywords: smallprint printgap noloewdin
keywords: NOSOSCF
formula: C19H24O3
InChI: InChI=1/C19H24O3/c1-7-8-13-12(4)16(10-15(13)20)22-18(21)17-14(9-11(2)3)19(17,5)6/h1,9,14,16-17H,8,10H2,2-6H3
46 atoms
O  -0.637663 0.064316 1.128707
O  -1.765785 -1.5154 2.225859
O  3.253514 -2.067809 0.09833
C  -3.237359 0.973962 -0.129764
C  -2.658854 -0.083338 -1.009417
C  -2.867851 -0.359139 0.486064
C  -2.482632 2.244048 0.179125
C  -4.72704 1.211847 -0.243295
C  -1.311181 0.022791 -1.621719
C  -1.731752 -0.660713 1.380325
C  -0.641305 -0.984061 -2.185198
C  0.577674 -0.344822 1.748832
C  0.699594 -0.76722 -2.819451
C  -1.14435 -2.395244 -2.220739
C  1.125976 -1.662277 1.204725
C  1.604526 0.691999 1.372377
C  2.646038 0.153893 0.729294
C  2.46684 -1.302677 0.59547
C  1.390986 2.126136 1.694818
C  3.844726 0.858374 0.169467
C  3.481878 1.834852 -0.849562
C  3.16262 2.63993 -1.680427
H  -3.384064 -0.608211 -1.6251
H  -3.709214 -0.999306 0.724541
H  -2.719723 2.998966 -0.572881
H  -2.788987 2.640888 1.148464
H  -1.404642 2.124693 0.198733
H  -4.940929 1.930317 -1.036565
H  -5.271999 0.295658 -0.473788
H  -5.131758 1.61195 0.687935
H  -0.850332 1.004615 -1.632928
H  0.44155 -0.379759 2.834673
H  0.483081 -2.08575 0.431075
H  1.239917 -2.425542 1.97432
H  1.459697 -1.40817 -2.365287
H  0.677272 -1.021945 -3.882235
H  1.038517 0.263983 -2.726251
H  -2.077808 -2.532262 -1.67815
H  -1.298059 -2.730003 -3.249792
H  -0.407868 -3.076759 -1.786606
H  2.326293 2.68244 1.725067
H  0.881634 2.246367 2.651567
H  0.764202 2.596477 0.934465
H  4.401661 1.359061 0.967506
H  4.522941 0.116199 -0.258653
H  2.889115 3.34815 -2.424794
totalener: -964.14225934 hartree
nucrepener: 1893.83199534 hartree
electener: -2857.97425468 hartree
oneelecener: -5072.24050200 hartree
twoeener: 2214.26624732 hartree
kineticenergy: 959.83113505 hartree
xcener: -94.700774724689 hartree
chargesum: -0.0000000
charge: -0.266487 -0.355718 -0.331938 0.140249 -0.047978 -0.107816 -0.251623 -0.248682 -0.139392 0.310565 -0.087550 0.203177 -0.206380 -0.244478 -0.112048 -0.028529 -0.046434 0.183850 -0.281338 -0.131779 -0.395552 0.053053 0.093955 0.086133 0.093571 0.095875 0.048328 0.088259 0.073590 0.092578 0.087445 0.096935 0.083079 0.105377 0.085307 0.098100 0.075018 0.087047 0.101159 0.087176 0.105002 0.106740 0.118806 0.118552 0.120129 0.244666
qa: -0.2665 -0.3557 -0.3319 0.1402 -0.0480 -0.1078 -0.2516 -0.2487 -0.1394 0.3106 -0.0875 0.2032 -0.2064 -0.2445 -0.1120 -0.0285 -0.0464 0.1839 -0.2813 -0.1318 -0.3956 0.0531 0.0940 0.0861 0.0936 0.0959 0.0483 0.0883 0.0736 0.0926 0.0874 0.0969 0.0831 0.1054 0.0853 0.0981 0.0750 0.0870 0.1012 0.0872 0.1050 0.1067 0.1188 0.1186 0.1201 0.2447
va: 2.0747 2.1532 2.1593 3.7526 3.8052 3.8500 3.9096 3.9111 3.8169 4.2450 3.7687 3.8031 3.9329 3.9392 3.8672 3.6964 3.4669 4.0760 3.9729 3.8916 3.8543 3.6242 1.0048 1.0281 1.0024 1.0044 1.0226 1.0041 1.0081 1.0037 1.0103 1.0154 1.0326 1.0257 1.0065 1.0016 1.0123 1.0072 1.0001 1.0005 1.0000 1.0051 0.9890 0.9869 1.0202 0.9743
dispcorr: -0.027336423 hartree
energy: -964.169595760466
dipole: -12.27890 11.64523 -0.63367 7.24743 -5.84026 1.40717 -9.34923 9.25902 -0.09021
magnitude: 1.54590 au
magnitude: 3.92936 debye
