program: Orca
programVersion: 5.0.2
elementType: O O O C C C C C C C C C C C C C C C C C C C H H H H H H H H H H H H H H H H H H H H H H H H
charge: 0
multiplicity: 1
keywords: wb97x-d3
keywords: def2-TZVPP
keywords: def2/J RIJCOSX
keywords: DEFGRID2
keywords: scfconv7
keywords: smallprint printgap noloewdin
keywords: NOSOSCF
formula: C19H24O3
InChI: InChI=1/C19H24O3/c1-7-8-13-12(4)16(10-15(13)20)22-18(21)17-14(9-11(2)3)19(17,5)6/h1,9,14,16-17H,8,10H2,2-6H3
46 atoms
O  -0.665241 0.18034 0.915817
O  -1.56158 -1.18713 2.432319
O  3.181095 -1.937115 -0.223959
C  -3.475806 0.794125 -0.066844
C  -2.954846 -0.36093 -0.854935
C  -2.938074 -0.410512 0.677511
C  -2.766472 2.126197 -0.062047
C  -4.978798 0.948423 0.003575
C  -1.715308 -0.2854 -1.666461
C  -1.679834 -0.508849 1.446116
C  -1.042297 -1.332888 -2.143813
C  0.634723 -0.052147 1.450918
C  0.183523 -1.148226 -2.985325
C  -1.425603 -2.756042 -1.874628
C  1.202165 -1.422998 1.091607
C  1.550537 0.94132 0.783243
C  2.555862 0.339361 0.138246
C  2.434009 -1.125262 0.259913
C  1.277843 2.39827 0.882926
C  3.674489 0.966331 -0.640515
C  4.517938 1.842883 0.161233
C  5.208351 2.568146 0.822363
H  -3.720762 -1.006572 -1.275957
H  -3.697201 -1.04018 1.126928
H  -2.971266 2.66253 0.865935
H  -1.689203 2.051896 -0.166658
H  -3.139347 2.740244 -0.884046
H  -5.48951 -0.015152 -0.009473
H  -5.277218 1.468493 0.915441
H  -5.345162 1.526631 -0.846619
H  -1.348077 0.705985 -1.909354
H  0.619427 0.109552 2.533517
H  0.501078 -2.021891 0.507838
H  1.466945 -2.013289 1.96891
H  0.068016 -1.623339 -3.962845
H  0.410199 -0.095483 -3.150527
H  1.056106 -1.611696 -2.517359
H  -0.578551 -3.313438 -1.466285
H  -2.252336 -2.851708 -1.173355
H  -1.707552 -3.266094 -2.799369
H  2.161214 2.995974 0.668349
H  0.917581 2.66299 1.87784
H  0.494462 2.687613 0.179151
H  4.288234 0.169791 -1.06884
H  3.272209 1.530768 -1.487058
H  5.828391 3.200044 1.410792
totalener: -964.14210408 hartree
nucrepener: 1869.86155321 hartree
electener: -2834.00365728 hartree
oneelecener: -5024.12651771 hartree
twoeener: 2190.12286043 hartree
kineticenergy: 959.83451187 hartree
xcener: -94.701575135564 hartree
chargesum: -0.0000000
charge: -0.267182 -0.355677 -0.332428 0.139646 -0.046478 -0.115372 -0.253944 -0.248467 -0.144102 0.316077 -0.069352 0.207969 -0.218252 -0.250669 -0.127533 -0.044504 -0.042161 0.199274 -0.274800 -0.156151 -0.427582 0.112727 0.095281 0.087632 0.096944 0.045264 0.095843 0.073442 0.093446 0.088403 0.085007 0.100326 0.084643 0.104352 0.098001 0.075389 0.087155 0.087657 0.088813 0.102970 0.108821 0.100191 0.116106 0.119605 0.118737 0.244933
qa: -0.2672 -0.3557 -0.3324 0.1396 -0.0465 -0.1154 -0.2539 -0.2485 -0.1441 0.3161 -0.0694 0.2080 -0.2183 -0.2507 -0.1275 -0.0445 -0.0422 0.1993 -0.2748 -0.1562 -0.4276 0.1127 0.0953 0.0876 0.0969 0.0453 0.0958 0.0734 0.0934 0.0884 0.0850 0.1003 0.0846 0.1044 0.0980 0.0754 0.0872 0.0877 0.0888 0.1030 0.1088 0.1002 0.1161 0.1196 0.1187 0.2449
va: 2.0764 2.1535 2.1589 3.7502 3.8089 3.8537 3.9096 3.9120 3.8295 4.2390 3.7621 3.7672 3.9338 3.9420 3.8820 3.6912 3.4729 4.0656 3.9489 3.9049 3.8992 3.5498 1.0053 1.0277 1.0047 1.0235 1.0021 1.0080 1.0038 1.0041 1.0096 1.0164 1.0310 1.0263 1.0016 1.0089 1.0051 1.0003 1.0063 1.0001 1.0135 1.0043 0.9908 1.0193 0.9863 0.9730
dispcorr: -0.026341441 hartree
energy: -964.168445518236
dipole: -15.28290 14.32976 -0.95315 5.19303 -3.89465 1.29838 -10.57976 10.10727 -0.47249
magnitude: 1.67855 au
magnitude: 4.26654 debye
