program: Orca
programVersion: 5.0.2
elementType: O O O C C C C C C C C C C C C C C C C C C C H H H H H H H H H H H H H H H H H H H H H H H H
charge: 0
multiplicity: 1
keywords: wb97x-d3
keywords: def2-TZVPP
keywords: def2/J RIJCOSX
keywords: DEFGRID2
keywords: scfconv7
keywords: smallprint printgap noloewdin
keywords: NOSOSCF
formula: C19H24O3
InChI: InChI=1/C19H24O3/c1-7-8-13-12(4)16(10-15(13)20)22-18(21)17-14(9-11(2)3)19(17,5)6/h1,9,14,16-17H,8,10H2,2-6H3
46 atoms
O  -0.454448 -0.354202 0.492651
O  -1.588322 -0.684771 2.39434
O  3.91176 -1.269391 -0.596812
C  -2.861928 1.219081 -0.481108
C  -3.00033 -0.17371 -0.995371
C  -2.773132 0.060056 0.496102
C  -1.656055 2.057702 -0.831479
C  -4.124845 2.043223 -0.367717
C  -2.002006 -0.804072 -1.896092
C  -1.564161 -0.360306 1.235882
C  -1.773874 -2.113946 -1.987975
C  0.780815 -0.774186 1.063727
C  -0.79439 -2.66809 -2.977585
C  -2.449497 -3.128673 -1.118214
C  1.584248 -1.570079 0.042218
C  1.638363 0.425193 1.38643
C  2.840028 0.345736 0.802439
C  2.935879 -0.882791 -0.006742
C  1.124434 1.503681 2.267794
C  3.979987 1.315642 0.894832
C  3.634004 2.637634 0.389237
C  3.334429 3.724734 -0.021472
H  -4.023821 -0.478383 -1.202426
H  -3.649987 -0.068228 1.12023
H  -1.448399 2.778758 -0.038246
H  -0.750569 1.484024 -1.002342
H  -1.86185 2.628204 -1.739171
H  -4.99164 1.430871 -0.116514
H  -4.026068 2.809148 0.403487
H  -4.339722 2.546681 -1.312067
H  -1.455014 -0.139107 -2.55745
H  0.587075 -1.348669 1.973323
H  1.116233 -1.519363 -0.943337
H  1.691272 -2.624875 0.296657
H  -0.010577 -3.243601 -2.477604
H  -1.283632 -3.354949 -3.672737
H  -0.314437 -1.885386 -3.564024
H  -1.711131 -3.696424 -0.54604
H  -3.146753 -2.686921 -0.409372
H  -2.998621 -3.856664 -1.720407
H  0.384294 2.10523 1.735171
H  1.911262 2.179379 2.595473
H  0.62337 1.087386 3.142369
H  4.320208 1.403014 1.931168
H  4.826043 0.918186 0.328798
H  3.077465 4.686716 -0.393753
totalener: -964.14233595 hartree
nucrepener: 1855.76829977 hartree
electener: -2819.91063573 hartree
oneelecener: -4995.99443835 hartree
twoeener: 2176.08380263 hartree
kineticenergy: 959.83087438 hartree
xcener: -94.701196749317 hartree
chargesum: 0.0000000
charge: -0.253222 -0.366504 -0.330223 0.143102 -0.042303 -0.143982 -0.312193 -0.244738 -0.165308 0.343579 -0.051948 0.161511 -0.228045 -0.247490 -0.120730 -0.027061 -0.060908 0.221299 -0.246928 -0.160309 -0.412173 0.086972 0.100399 0.092176 0.091411 0.098148 0.097900 0.073167 0.092022 0.087674 0.093242 0.105566 0.082338 0.093500 0.081112 0.100097 0.089390 0.086818 0.089217 0.098087 0.104403 0.096742 0.120691 0.119351 0.119366 0.244786
qa: -0.2532 -0.3665 -0.3302 0.1431 -0.0423 -0.1440 -0.3122 -0.2447 -0.1653 0.3436 -0.0519 0.1615 -0.2280 -0.2475 -0.1207 -0.0271 -0.0609 0.2213 -0.2469 -0.1603 -0.4122 0.0870 0.1004 0.0922 0.0914 0.0981 0.0979 0.0732 0.0920 0.0877 0.0932 0.1056 0.0823 0.0935 0.0811 0.1001 0.0894 0.0868 0.0892 0.0981 0.1044 0.0967 0.1207 0.1194 0.1194 0.2448
va: 2.0653 2.1370 2.1764 3.6920 3.8262 3.8489 3.9157 3.9120 3.8428 4.2059 3.7370 3.8084 3.9290 3.9496 3.8565 3.6632 3.4769 4.1397 3.9544 3.9206 3.8630 3.5819 1.0068 1.0269 1.0016 1.0113 1.0040 1.0086 1.0040 1.0044 1.0081 1.0321 1.0394 1.0256 0.9976 1.0009 1.0071 1.0005 1.0077 1.0015 0.9981 1.0039 1.0112 0.9851 1.0194 0.9734
dispcorr: -0.025510977 hartree
energy: -964.167846931801
dipole: -16.25420 15.19917 -1.05503 1.15867 -0.65795 0.50072 -7.86440 7.77144 -0.09296
magnitude: 1.17152 au
magnitude: 2.97776 debye
