program: Orca
programVersion: 5.0.2
elementType: O O O C C C C C C C C C C C C C C C C C C C H H H H H H H H H H H H H H H H H H H H H H H H
charge: 0
multiplicity: 1
keywords: wb97x-d3
keywords: def2-TZVPP
keywords: def2/J RIJCOSX
keywords: DEFGRID2
keywords: scfconv7
keywords: smallprint printgap noloewdin
keywords: NOSOSCF
formula: C19H24O3
InChI: InChI=1/C19H24O3/c1-7-8-13-12(4)16(10-15(13)20)22-18(21)17-14(9-11(2)3)19(17,5)6/h1,9,14,16-17H,8,10H2,2-6H3
46 atoms
O  -0.657784 0.18767 0.911581
O  -1.554085 -1.18306 2.42543
O  3.179882 -1.889766 -0.317216
C  -3.453971 0.813338 -0.08137
C  -2.958782 -0.367207 -0.847961
C  -2.937174 -0.38597 0.685581
C  -2.722959 2.133473 -0.104368
C  -4.954103 0.995362 -0.011212
C  -1.718498 -0.340611 -1.660964
C  -1.673982 -0.498626 1.443865
C  -1.088951 -1.415588 -2.137303
C  0.643824 -0.062038 1.434428
C  0.144115 -1.28298 -2.978233
C  -1.529225 -2.822185 -1.86726
C  1.207142 -1.420038 1.023851
C  1.561568 0.953646 0.803948
C  2.5672 0.373367 0.139583
C  2.4375 -1.094657 0.200669
C  1.292892 2.406005 0.961576
C  3.693025 1.024747 -0.608481
C  4.527386 1.876802 0.22842
C  5.210095 2.583115 0.917638
H  -3.739847 -1.004599 -1.253109
H  -3.704835 -0.993415 1.150788
H  -1.647982 2.040866 -0.21671
H  -3.093166 2.74007 -0.932965
H  -2.911856 2.687494 0.816632
H  -5.481733 0.040942 -0.000973
H  -5.241261 1.541673 0.888857
H  -5.312262 1.560018 -0.873904
H  -1.311351 0.634628 -1.904968
H  0.631297 0.060288 2.522069
H  0.502112 -1.994779 0.420903
H  1.473742 -2.042001 1.878529
H  0.010085 -1.755331 -3.954701
H  0.414016 -0.240826 -3.145404
H  0.997167 -1.77997 -2.508737
H  -2.362865 -2.884795 -1.170471
H  -1.824717 -3.322796 -2.792963
H  -0.707017 -3.410903 -1.452116
H  0.962003 2.634489 1.975577
H  0.48874 2.719845 0.292719
H  2.169608 3.011878 0.743624
H  4.311519 0.241965 -1.054995
H  3.299449 1.614495 -1.441744
H  5.822469 3.1981 1.531628
totalener: -964.14240691 hartree
nucrepener: 1867.42100668 hartree
electener: -2831.56341359 hartree
oneelecener: -5019.25709102 hartree
twoeener: 2187.69367743 hartree
kineticenergy: 959.83319172 hartree
xcener: -94.701573314310 hartree
chargesum: -0.0000000
charge: -0.269352 -0.356069 -0.333164 0.141257 -0.049032 -0.109821 -0.257540 -0.248375 -0.142408 0.315737 -0.078029 0.208729 -0.218888 -0.244673 -0.125127 -0.050555 -0.036150 0.199359 -0.268986 -0.157288 -0.426010 0.109783 0.094273 0.086998 0.048521 0.095572 0.097497 0.073518 0.093159 0.088646 0.085974 0.100701 0.082644 0.104508 0.097859 0.076112 0.088357 0.087368 0.102078 0.087658 0.099070 0.115490 0.106512 0.120185 0.119049 0.244854
qa: -0.2694 -0.3561 -0.3332 0.1413 -0.0490 -0.1098 -0.2575 -0.2484 -0.1424 0.3157 -0.0780 0.2087 -0.2189 -0.2447 -0.1251 -0.0506 -0.0361 0.1994 -0.2690 -0.1573 -0.4260 0.1098 0.0943 0.0870 0.0485 0.0956 0.0975 0.0735 0.0932 0.0886 0.0860 0.1007 0.0826 0.1045 0.0979 0.0761 0.0884 0.0874 0.1021 0.0877 0.0991 0.1155 0.1065 0.1202 0.1190 0.2449
va: 2.0753 2.1526 2.1588 3.7473 3.8100 3.8535 3.9075 3.9114 3.8259 4.2391 3.7676 3.7646 3.9333 3.9398 3.8853 3.6955 3.4733 4.0723 3.9510 3.9033 3.8932 3.5542 1.0054 1.0278 1.0235 1.0023 1.0039 1.0079 1.0039 1.0041 1.0095 1.0171 1.0313 1.0263 1.0013 1.0094 1.0053 1.0072 0.9996 1.0005 1.0040 0.9922 1.0140 1.0190 0.9863 0.9731
dispcorr: -0.026170591 hartree
energy: -964.168577500233
dipole: -15.39267 14.44327 -0.94940 4.86275 -3.58537 1.27738 -10.40775 9.97398 -0.43377
magnitude: 1.64961 au
magnitude: 4.19297 debye
