program: Orca
programVersion: 5.0.2
elementType: O O O C C C C C C C C C C C C C C C C C C C H H H H H H H H H H H H H H H H H H H H H H H H
charge: 0
multiplicity: 1
keywords: wb97x-d3
keywords: def2-TZVPP
keywords: def2/J RIJCOSX
keywords: DEFGRID2
keywords: scfconv7
keywords: smallprint printgap noloewdin
keywords: NOSOSCF
formula: C19H24O3
InChI: InChI=1/C19H24O3/c1-7-8-13-12(4)16(10-15(13)20)22-18(21)17-14(9-11(2)3)19(17,5)6/h1,9,14,16-17H,8,10H2,2-6H3
46 atoms
O  -0.168933 -0.739843 1.134581
O  -1.389013 1.138377 1.103508
O  4.071933 -1.403753 2.822213
C  -3.726688 -0.611639 0.086412
C  -2.91499 -0.34935 -1.140345
C  -2.240757 -0.884317 0.132906
C  -4.356388 0.510457 0.875477
C  -4.5912 -1.852365 0.060199
C  -2.630602 1.002516 -1.657846
C  -1.26825 -0.029139 0.839647
C  -2.097852 1.285843 -2.849823
C  0.924592 -0.077565 1.765906
C  -1.87947 2.70931 -3.267968
C  -1.664388 0.269641 -3.86313
C  1.67185 -1.049214 2.669858
C  1.94653 0.373361 0.747664
C  3.172566 -0.068311 1.0548
C  3.126514 -0.912223 2.261791
C  1.556149 1.231852 -0.399186
C  4.463089 0.208067 0.342237
C  4.486296 -0.312205 -1.018463
C  4.498723 -0.733804 -2.141759
H  -2.998811 -1.115252 -1.903488
H  -1.94971 -1.927466 0.091528
H  -4.535709 0.189636 1.902959
H  -3.7573 1.413463 0.920461
H  -5.323181 0.763331 0.437016
H  -4.1351 -2.659764 -0.514442
H  -4.770183 -2.225281 1.070189
H  -5.560197 -1.632964 -0.391342
H  -2.881993 1.836646 -1.015006
H  0.55568 0.789451 2.320552
H  1.347396 -2.076548 2.492384
H  1.542199 -0.846868 3.733054
H  -2.208432 3.415339 -2.506881
H  -0.822246 2.900865 -3.468826
H  -2.417336 2.936125 -4.192097
H  -1.786892 -0.759955 -3.535052
H  -2.220378 0.391183 -4.795966
H  -0.609628 0.407246 -4.113421
H  2.4183 1.567213 -0.971426
H  0.991926 2.10091 -0.058901
H  0.901794 0.68671 -1.08352
H  4.657361 1.284556 0.31854
H  5.280959 -0.237059 0.914336
H  4.514277 -1.118047 -3.132685
totalener: -964.14741045 hartree
nucrepener: 1792.68491661 hartree
electener: -2756.83232706 hartree
oneelecener: -4869.99863514 hartree
twoeener: 2113.16630808 hartree
kineticenergy: 959.82253800 hartree
xcener: -94.699976458358 hartree
chargesum: -0.0000000
charge: -0.276332 -0.394436 -0.330226 0.107677 -0.006487 -0.057932 -0.268338 -0.239943 -0.190344 0.315338 -0.061747 0.214941 -0.206682 -0.246171 -0.132344 -0.041484 -0.058407 0.218184 -0.241980 -0.160532 -0.417276 0.094640 0.083157 0.081304 0.086052 0.104041 0.089734 0.070833 0.090370 0.091143 0.098700 0.097510 0.091101 0.087063 0.081190 0.080700 0.087568 0.081856 0.095488 0.083991 0.094592 0.120119 0.100566 0.119454 0.119095 0.244250
qa: -0.2763 -0.3944 -0.3302 0.1077 -0.0065 -0.0579 -0.2683 -0.2399 -0.1903 0.3153 -0.0617 0.2149 -0.2067 -0.2462 -0.1323 -0.0415 -0.0584 0.2182 -0.2420 -0.1605 -0.4173 0.0946 0.0832 0.0813 0.0861 0.1040 0.0897 0.0708 0.0904 0.0911 0.0987 0.0975 0.0911 0.0871 0.0812 0.0807 0.0876 0.0819 0.0955 0.0840 0.0946 0.1201 0.1006 0.1195 0.1191 0.2442
va: 2.1215 2.0871 2.1732 3.7728 3.8067 3.8409 3.9081 3.8994 3.8948 4.1828 3.8023 3.7968 3.9376 3.9455 3.8723 3.7080 3.4859 4.1132 3.9537 3.9142 3.8674 3.5707 1.0086 1.0311 1.0027 1.0229 0.9997 1.0075 1.0053 1.0042 1.0205 1.0276 1.0317 1.0281 1.0124 0.9990 0.9986 1.0123 0.9992 0.9995 1.0060 1.0087 1.0019 0.9849 1.0197 0.9736
dispcorr: -0.022384353 hartree
energy: -964.169794802520
dipole: -22.10713 20.90273 -1.20441 5.79851 -5.57009 0.22842 -16.12046 15.17214 -0.94832
magnitude: 1.54987 au
magnitude: 3.93944 debye
