program: Orca
programVersion: 5.0.2
elementType: O O O C C C C C C C C C C C C C C C C C C C H H H H H H H H H H H H H H H H H H H H H H H H
charge: 0
multiplicity: 1
keywords: wb97x-d3
keywords: def2-TZVPP
keywords: def2/J RIJCOSX
keywords: DEFGRID2
keywords: scfconv7
keywords: smallprint printgap noloewdin
keywords: NOSOSCF
formula: C19H24O3
InChI: InChI=1/C19H24O3/c1-7-8-13-12(4)16(10-15(13)20)22-18(21)17-14(9-11(2)3)19(17,5)6/h1,9,14,16-17H,8,10H2,2-6H3
46 atoms
O  -0.623894 0.181219 0.898821
O  -1.517806 -1.312855 2.293151
O  3.121418 -1.639059 -0.732221
C  -3.354899 0.867976 -0.147043
C  -2.989928 -0.391692 -0.859743
C  -2.919226 -0.327565 0.671188
C  -2.52009 2.119172 -0.283276
C  -4.83139 1.181797 -0.041512
C  -1.776259 -0.520117 -1.70405
C  -1.641778 -0.536146 1.383319
C  -1.228831 -1.675529 -2.085547
C  0.678734 -0.113836 1.398062
C  -0.033636 -1.710268 -2.988956
C  -1.736261 -3.01571 -1.64757
C  1.258276 -1.397125 0.810726
C  1.58401 0.988823 0.90738
C  2.557821 0.519676 0.119667
C  2.422611 -0.939984 -0.043423
C  1.34699 2.39228 1.329868
C  3.660608 1.278489 -0.556596
C  4.496489 2.027254 0.372431
C  5.179773 2.646088 1.140488
H  -3.83392 -0.981252 -1.20748
H  -3.719198 -0.848609 1.184269
H  -1.47149 1.932188 -0.489511
H  -2.914218 2.726569 -1.100247
H  -2.579554 2.71893 0.626639
H  -5.175576 1.710763 -0.931989
H  -5.436596 0.280078 0.059827
H  -5.035332 1.815406 0.823365
H  -1.326518 0.398962 -2.064504
H  0.654437 -0.137195 2.491542
H  0.535012 -1.94638 0.207152
H  1.61245 -2.080987 1.583315
H  0.284908 -0.711508 -3.28501
H  0.815505 -2.202107 -2.507734
H  -0.246109 -2.277886 -3.898399
H  -2.083729 -3.599657 -2.503694
H  -0.934493 -3.598582 -1.186452
H  -2.550847 -2.953052 -0.928678
H  1.998397 3.097495 0.819202
H  1.528105 2.494797 2.402717
H  0.309937 2.6825 1.155714
H  4.280209 0.57019 -1.1125
H  3.24506 1.965396 -1.300148
H  5.79206 3.18306 1.823842
totalener: -964.14321694 hartree
nucrepener: 1864.79667017 hartree
electener: -2828.93988711 hartree
oneelecener: -5014.09427032 hartree
twoeener: 2185.15438321 hartree
kineticenergy: 959.83136756 hartree
xcener: -94.700979313476 hartree
chargesum: 0.0000000
charge: -0.270642 -0.357783 -0.337974 0.159744 -0.055521 -0.115906 -0.283855 -0.248841 -0.159517 0.317026 -0.078710 0.222296 -0.207690 -0.236994 -0.116900 -0.065735 -0.030872 0.210704 -0.243405 -0.164928 -0.422668 0.103570 0.093545 0.086826 0.070018 0.095542 0.098342 0.088515 0.073270 0.092541 0.088777 0.098017 0.073568 0.102353 0.077104 0.086445 0.095989 0.100633 0.088475 0.087708 0.093568 0.104496 0.103633 0.120621 0.119036 0.245578
qa: -0.2706 -0.3578 -0.3380 0.1597 -0.0555 -0.1159 -0.2839 -0.2488 -0.1595 0.3170 -0.0787 0.2223 -0.2077 -0.2370 -0.1169 -0.0657 -0.0309 0.2107 -0.2434 -0.1649 -0.4227 0.1036 0.0935 0.0868 0.0700 0.0955 0.0983 0.0885 0.0733 0.0925 0.0888 0.0980 0.0736 0.1024 0.0771 0.0864 0.0960 0.1006 0.0885 0.0877 0.0936 0.1045 0.1036 0.1206 0.1190 0.2456
va: 2.0792 2.1475 2.1531 3.6969 3.8361 3.8455 3.9145 3.9111 3.8235 4.2400 3.7683 3.7587 3.9286 3.9355 3.8910 3.7079 3.4968 4.0657 3.9555 3.9064 3.8706 3.5633 1.0062 1.0283 1.0127 1.0036 1.0002 1.0044 1.0080 1.0037 1.0104 1.0199 1.0359 1.0264 1.0100 1.0076 1.0002 0.9995 1.0008 1.0086 1.0071 1.0003 1.0061 1.0189 0.9858 0.9727
dispcorr: -0.025974277 hartree
energy: -964.169191212389
dipole: -15.31721 14.43481 -0.88241 3.88312 -2.67555 1.20757 -8.96690 8.79944 -0.16746
magnitude: 1.50496 au
magnitude: 3.82530 debye
