program: Orca
programVersion: 5.0.2
elementType: O O O C C C C C C C C C C C C C C C C C C C H H H H H H H H H H H H H H H H H H H H H H H H
charge: 0
multiplicity: 1
keywords: wb97x-d3
keywords: def2-TZVPP
keywords: def2/J RIJCOSX
keywords: DEFGRID2
keywords: scfconv7
keywords: smallprint printgap noloewdin
keywords: NOSOSCF
formula: C19H24O3
InChI: InChI=1/C19H24O3/c1-7-8-13-12(4)16(10-15(13)20)22-18(21)17-14(9-11(2)3)19(17,5)6/h1,9,14,16-17H,8,10H2,2-6H3
46 atoms
O  0.397091 -0.168499 0.065721
O  -1.455608 0.302965 1.215971
O  3.63089 -0.781286 3.316507
C  -2.85748 -1.730126 -0.672859
C  -2.915334 -0.450208 -1.44671
C  -1.587557 -0.923185 -0.848372
C  -3.541591 -1.853807 0.666763
C  -2.908393 -3.011789 -1.472191
C  -3.611896 0.756353 -0.966398
C  -0.930323 -0.20056 0.257841
C  -4.363049 1.578095 -1.70525
C  1.175658 0.500512 1.053953
C  -5.013551 2.776726 -1.079755
C  -4.641769 1.424638 -3.170132
C  1.470818 -0.349372 2.285229
C  2.521432 0.799696 0.447232
C  3.521879 0.357555 1.217883
C  2.98313 -0.327833 2.408573
C  2.609496 1.539625 -0.836849
C  4.998927 0.502922 1.001057
C  5.448756 -0.041068 -0.273637
C  5.80998 -0.479317 -1.330649
H  -2.934267 -0.582897 -2.522628
H  -0.884336 -1.319809 -1.57135
H  -3.069541 -2.63634 1.263543
H  -3.531333 -0.942777 1.255391
H  -4.583319 -2.14009 0.511937
H  -3.942891 -3.305025 -1.659865
H  -2.412617 -2.914502 -2.43913
H  -2.423855 -3.827393 -0.932289
H  -3.500493 0.99703 0.083223
H  0.679946 1.437055 1.329704
H  1.139798 -1.38091 2.145987
H  0.993926 0.020451 3.192356
H  -4.686801 3.699656 -1.56617
H  -6.100606 2.737419 -1.187063
H  -4.784441 2.859962 -0.018225
H  -5.716922 1.341276 -3.347217
H  -4.306013 2.306886 -3.720824
H  -4.170408 0.555431 -3.62291
H  2.267699 0.910451 -1.660571
H  3.623633 1.8589 -1.064216
H  1.96098 2.418015 -0.820938
H  5.285989 1.557271 1.063583
H  5.522817 -0.00101 1.817187
H  6.132808 -0.880783 -2.260509
totalener: -964.14836022 hartree
nucrepener: 1747.28347261 hartree
electener: -2711.43183283 hartree
oneelecener: -4779.23277381 hartree
twoeener: 2067.80094098 hartree
kineticenergy: 959.82041695 hartree
xcener: -94.698755999900 hartree
chargesum: -0.0000000
charge: -0.284460 -0.395470 -0.329054 0.087167 0.032480 -0.078365 -0.253802 -0.237570 -0.221062 0.332609 -0.058364 0.213865 -0.203167 -0.240494 -0.150468 -0.027995 -0.050679 0.232453 -0.256757 -0.153048 -0.418381 0.095357 0.086542 0.081277 0.086491 0.103687 0.087591 0.090547 0.069697 0.089420 0.109650 0.088999 0.086907 0.099225 0.081638 0.082830 0.081585 0.087535 0.086835 0.075977 0.111463 0.093893 0.100409 0.118511 0.119984 0.244514
qa: -0.2845 -0.3955 -0.3291 0.0872 0.0325 -0.0784 -0.2538 -0.2376 -0.2211 0.3326 -0.0584 0.2139 -0.2032 -0.2405 -0.1505 -0.0280 -0.0507 0.2325 -0.2568 -0.1530 -0.4184 0.0954 0.0865 0.0813 0.0865 0.1037 0.0876 0.0905 0.0697 0.0894 0.1096 0.0890 0.0869 0.0992 0.0816 0.0828 0.0816 0.0875 0.0868 0.0760 0.1115 0.0939 0.1004 0.1185 0.1200 0.2445
va: 2.1238 2.0950 2.1743 3.7483 3.7850 3.8800 3.9197 3.9095 3.9010 4.1561 3.8183 3.8059 3.9375 3.9462 3.8868 3.6580 3.5092 4.0910 3.9672 3.9045 3.8652 3.5716 1.0101 1.0297 1.0025 1.0188 1.0021 1.0037 1.0084 1.0051 1.0262 1.0212 1.0288 1.0275 0.9983 0.9983 1.0125 0.9995 0.9991 1.0169 1.0029 1.0061 1.0034 0.9854 1.0197 0.9733
dispcorr: -0.020756750 hartree
energy: -964.169116966889
dipole: -26.79271 26.02609 -0.76662 2.37143 -1.92399 0.44744 -14.99757 13.40253 -1.59503
magnitude: 1.82539 au
magnitude: 4.63977 debye
