program: Orca
programVersion: 5.0.2
elementType: O O O C C C C C C C C C C C C C C C C C C C H H H H H H H H H H H H H H H H H H H H H H H H
charge: 0
multiplicity: 1
keywords: wb97x-d3
keywords: def2-TZVPP
keywords: def2/J RIJCOSX
keywords: DEFGRID2
keywords: scfconv7
keywords: smallprint printgap noloewdin
keywords: NOSOSCF
formula: C19H24O3
InChI: InChI=1/C19H24O3/c1-7-8-13-12(4)16(10-15(13)20)22-18(21)17-14(9-11(2)3)19(17,5)6/h1,9,14,16-17H,8,10H2,2-6H3
46 atoms
O  0.411251 0.241521 0.011325
O  -0.905524 -1.493656 0.485714
O  4.609707 -1.710853 0.334553
C  -2.469651 -0.602422 -2.069799
C  -3.145165 0.128265 -0.951246
C  -1.623752 0.18172 -1.084325
C  -2.449248 -2.110476 -2.099847
C  -2.57283 0.008106 -3.448248
C  -3.826708 -0.552188 0.165638
C  -0.718057 -0.469855 -0.118545
C  -5.036986 -0.251291 0.644918
C  1.388484 -0.267468 0.915239
C  -5.614481 -1.033006 1.788205
C  -5.93034 0.838337 0.132478
C  2.190314 -1.447436 0.373689
C  2.401685 0.82212 1.149599
C  3.65175 0.383429 0.96568
C  3.639424 -1.024489 0.527859
C  1.964799 2.178023 1.565422
C  4.934752 1.135637 1.154681
C  5.064821 2.264309 0.242648
C  5.15906 3.196023 -0.507387
H  -3.599644 1.066766 -1.248675
H  -1.234623 1.120748 -1.459919
H  -2.391101 -2.571756 -1.119284
H  -3.358163 -2.472076 -2.583506
H  -1.600088 -2.46865 -2.684673
H  -3.484132 -0.326763 -3.946879
H  -2.596113 1.098086 -3.414272
H  -1.725781 -0.285741 -4.070767
H  -3.297253 -1.371921 0.633517
H  0.90121 -0.52638 1.861535
H  1.981537 -1.619963 -0.684418
H  1.991406 -2.383086 0.894867
H  -5.829774 -0.382868 2.640212
H  -6.561704 -1.500669 1.507366
H  -4.941637 -1.818513 2.12955
H  -6.883113 0.422692 -0.204672
H  -6.167884 1.549484 0.927543
H  -5.510591 1.40032 -0.698668
H  1.486615 2.692584 0.73021
H  2.795137 2.795849 1.900119
H  1.22517 2.120515 2.366205
H  5.015715 1.493168 2.185655
H  5.769861 0.447046 1.002737
H  5.250945 4.014964 -1.17841
totalener: -964.14827882 hartree
nucrepener: 1745.80894614 hartree
electener: -2709.95722496 hartree
oneelecener: -4776.29264352 hartree
twoeener: 2066.33541856 hartree
kineticenergy: 959.82383590 hartree
xcener: -94.699113797076 hartree
chargesum: 0.0000000
charge: -0.283246 -0.395802 -0.328885 0.086198 0.028759 -0.077010 -0.255307 -0.238358 -0.222371 0.330399 -0.051650 0.213625 -0.205020 -0.241644 -0.147827 -0.032743 -0.047923 0.229571 -0.252481 -0.152519 -0.416497 0.093639 0.087650 0.080845 0.103425 0.088481 0.087110 0.090265 0.070458 0.089874 0.112136 0.088677 0.086010 0.100217 0.082298 0.082674 0.081195 0.087277 0.087015 0.076632 0.111157 0.091691 0.100766 0.117418 0.119523 0.244300
qa: -0.2832 -0.3958 -0.3289 0.0862 0.0288 -0.0770 -0.2553 -0.2384 -0.2224 0.3304 -0.0517 0.2136 -0.2050 -0.2416 -0.1478 -0.0327 -0.0479 0.2296 -0.2525 -0.1525 -0.4165 0.0936 0.0877 0.0808 0.1034 0.0885 0.0871 0.0903 0.0705 0.0899 0.1121 0.0887 0.0860 0.1002 0.0823 0.0827 0.0812 0.0873 0.0870 0.0766 0.1112 0.0917 0.1008 0.1174 0.1195 0.2443
va: 2.1280 2.0944 2.1750 3.7473 3.7891 3.8960 3.9223 3.9090 3.8955 4.1558 3.8076 3.8155 3.9392 3.9460 3.8790 3.6789 3.5014 4.0898 3.9700 3.9054 3.8631 3.5742 1.0106 1.0288 1.0183 1.0025 1.0025 1.0036 1.0085 1.0050 1.0268 1.0190 1.0287 1.0279 0.9982 0.9983 1.0128 0.9995 0.9990 1.0162 1.0026 1.0056 1.0031 0.9858 1.0202 0.9735
dispcorr: -0.020816845 hartree
energy: -964.169095666556
dipole: -30.44310 29.09974 -1.34336 2.62072 -1.35818 1.26254 -4.29131 4.31133 0.02002
magnitude: 1.84365 au
magnitude: 4.68618 debye
