program: Orca
programVersion: 5.0.2
elementType: O O O C C C C C C C C C C C C C C C C C C C H H H H H H H H H H H H H H H H H H H H H H H H
charge: 0
multiplicity: 1
keywords: wb97x-d3
keywords: def2-TZVPP
keywords: def2/J RIJCOSX
keywords: DEFGRID2
keywords: scfconv7
keywords: smallprint printgap noloewdin
keywords: NOSOSCF
formula: C19H24O3
InChI: InChI=1/C19H24O3/c1-7-8-13-12(4)16(10-15(13)20)22-18(21)17-14(9-11(2)3)19(17,5)6/h1,9,14,16-17H,8,10H2,2-6H3
46 atoms
O  -0.277233 -0.534858 1.178837
O  -1.254544 1.355074 0.482578
O  3.924577 -1.054916 3.046217
C  -3.87075 -0.301733 0.338321
C  -3.192762 -0.522246 -0.968761
C  -2.417442 -0.736085 0.341169
C  -4.285308 1.07747 0.787925
C  -4.839277 -1.370547 0.790493
C  -2.856717 0.57393 -1.907507
C  -1.299339 0.162097 0.662863
C  -2.062972 0.437164 -2.97348
C  0.9338 0.144154 1.510566
C  -1.810509 1.578503 -3.909779
C  -1.365277 -0.842106 -3.324688
C  1.584243 -0.499914 2.726357
C  1.952296 0.001404 0.404751
C  3.128097 -0.438532 0.877188
C  3.021246 -0.710142 2.31534
C  1.624281 0.370534 -0.992367
C  4.404607 -0.637017 0.114182
C  4.975314 0.618698 -0.358464
C  5.434536 1.657414 -0.751725
H  -3.425998 -1.468137 -1.448799
H  -2.241436 -1.771736 0.607571
H  -4.305421 1.131423 1.878178
H  -3.644016 1.878341 0.432769
H  -5.297089 1.284239 0.433325
H  -4.533321 -2.365793 0.465041
H  -4.924277 -1.38783 1.878926
H  -5.834397 -1.181079 0.382705
H  -3.316147 1.541416 -1.732852
H  0.732749 1.203823 1.68539
H  1.135436 -1.472466 2.944731
H  1.513265 0.1043 3.630882
H  -2.07626 1.313784 -4.936921
H  -2.373894 2.470605 -3.635983
H  -0.749228 1.841951 -3.925728
H  -1.363778 -1.569352 -2.513962
H  -1.834144 -1.315348 -4.192864
H  -0.326195 -0.65305 -3.604982
H  2.470541 0.244239 -1.664738
H  1.292624 1.409373 -1.050377
H  0.803511 -0.243738 -1.371302
H  5.134832 -1.144493 0.749323
H  4.235424 -1.297647 -0.740564
H  5.842203 2.57814 -1.103834
elementType: O C H
totalener: -964.17011475 hartree
nucrepener: 1797.05767482 hartree
electener: -2761.22778958 hartree
oneelecener: -4878.90132904 hartree
twoeener: 2117.67353947 hartree
cpcmener: -0.03160122 hartree
kineticenergy: 959.76224281 hartree
xcener: -94.695529119765 hartree
chargesum: -0.0000000
charge: -0.295160 -0.461193 -0.445751 0.132819 -0.034555 -0.078827 -0.296775 -0.260198 -0.234746 0.357329 -0.035407 0.244694 -0.223502 -0.297528 -0.135026 -0.015265 -0.090503 0.289236 -0.261450 -0.106862 -0.463580 0.053601 0.112599 0.090857 0.100657 0.093198 0.099668 0.086079 0.095710 0.094880 0.121982 0.106329 0.102289 0.097722 0.095379 0.088735 0.092614 0.095669 0.118365 0.094668 0.102364 0.119297 0.117684 0.110765 0.134314 0.286828
qa: -0.2952 -0.4612 -0.4458 0.1328 -0.0346 -0.0788 -0.2968 -0.2602 -0.2347 0.3573 -0.0354 0.2447 -0.2235 -0.2975 -0.1350 -0.0153 -0.0905 0.2892 -0.2615 -0.1069 -0.4636 0.0536 0.1126 0.0909 0.1007 0.0932 0.0997 0.0861 0.0957 0.0949 0.1220 0.1063 0.1023 0.0977 0.0954 0.0887 0.0926 0.0957 0.1184 0.0947 0.1024 0.1193 0.1177 0.1108 0.1343 0.2868
va: 2.1204 2.0251 2.0613 3.7689 3.8016 3.8513 3.8953 3.8938 3.8325 4.1284 3.7020 3.7828 3.9285 3.9496 3.9083 3.7127 3.5175 4.0638 3.9419 3.8790 3.8282 3.5273 1.0012 1.0312 0.9999 1.0196 0.9989 1.0046 1.0025 1.0022 1.0030 1.0306 1.0277 1.0250 0.9953 1.0082 0.9960 1.0011 0.9977 0.9956 1.0046 1.0037 0.9965 1.0203 0.9877 0.9470
dispcorr: -0.023174708 hartree
energy: -964.193289462435
dipole: -21.90025 20.17943 -1.72081 0.74606 -1.37100 -0.62494 -16.21109 14.72470 -1.48640
magnitude: 2.35820 au
magnitude: 5.99407 debye
