program: Orca
programVersion: 5.0.2
elementType: O O O C C C C C C C C C C C C C C C C C C C H H H H H H H H H H H H H H H H H H H H H H H H
charge: 0
multiplicity: 1
keywords: wb97x-d3
keywords: def2-TZVPP
keywords: def2/J RIJCOSX
keywords: DEFGRID2
keywords: scfconv7
keywords: smallprint printgap noloewdin
keywords: NOSOSCF
formula: C19H24O3
InChI: InChI=1/C19H24O3/c1-7-8-13-12(4)16(10-15(13)20)22-18(21)17-14(9-11(2)3)19(17,5)6/h1,9,14,16-17H,8,10H2,2-6H3
46 atoms
O  -0.181514 -0.732766 1.004466
O  -1.411483 1.139958 0.990405
O  3.994814 -1.5121 2.787498
C  -3.756212 -0.666761 0.072998
C  -3.039385 -0.289448 -1.176041
C  -2.254988 -0.875563 0.007863
C  -4.372364 0.37838 0.969709
C  -4.559787 -1.946514 0.039944
C  -2.860745 1.114604 -1.617463
C  -1.284535 -0.028767 0.715472
C  -1.992937 1.502919 -2.556093
C  0.906785 -0.095743 1.675715
C  -1.908529 2.930399 -3.001067
C  -1.050642 0.562167 -3.243427
C  1.612437 -1.090881 2.587051
C  1.962004 0.346819 0.691397
C  3.172612 -0.125202 1.023566
C  3.070875 -0.981577 2.209738
C  1.625528 1.211261 -0.463874
C  4.475843 0.138121 0.329445
C  4.525389 -0.452536 -1.002562
C  4.549332 -0.934138 -2.10331
H  -3.123863 -1.006746 -1.987418
H  -1.934101 -1.903074 -0.116577
H  -3.856168 1.33357 0.967309
H  -5.402487 0.56083 0.656776
H  -4.40476 0.024047 2.001896
H  -4.107488 -2.698537 -0.608029
H  -4.649265 -2.378576 1.03872
H  -5.569026 -1.755214 -0.330473
H  -3.50711 1.864705 -1.172806
H  0.544778 0.769246 2.236597
H  1.272737 -2.112415 2.399624
H  1.464131 -0.886513 3.647687
H  -2.055384 3.015835 -4.081293
H  -2.650113 3.560759 -2.510283
H  -0.919468 3.346972 -2.791238
H  -0.945026 -0.392885 -2.730805
H  -1.386348 0.353992 -4.263914
H  -0.056214 1.005014 -3.333828
H  1.077637 0.638599 -1.217101
H  2.512148 1.619799 -0.945666
H  0.982133 2.039442 -0.164222
H  4.64925 1.214986 0.249049
H  5.298064 -0.25772 0.930425
H  4.570628 -1.362519 -3.080053
elementType: O C H
totalener: -964.16972955 hartree
nucrepener: 1806.19820902 hartree
electener: -2770.36793856 hartree
oneelecener: -4897.26905365 hartree
twoeener: 2126.90111508 hartree
cpcmener: -0.03136297 hartree
kineticenergy: 959.76806772 hartree
xcener: -94.696228177843 hartree
chargesum: -0.0000000
charge: -0.293588 -0.462190 -0.445551 0.132961 -0.028234 -0.087587 -0.296130 -0.262883 -0.246481 0.366540 -0.020848 0.239780 -0.222821 -0.306377 -0.130435 0.004125 -0.093424 0.282567 -0.293131 -0.103369 -0.458172 0.042685 0.112968 0.092169 0.092770 0.099317 0.100535 0.086863 0.095963 0.094327 0.121256 0.103562 0.101967 0.099255 0.095701 0.088770 0.092842 0.097408 0.119399 0.094577 0.130297 0.109715 0.120424 0.133429 0.111527 0.287519
qa: -0.2936 -0.4622 -0.4456 0.1330 -0.0282 -0.0876 -0.2961 -0.2629 -0.2465 0.3665 -0.0208 0.2398 -0.2228 -0.3064 -0.1304 0.0041 -0.0934 0.2826 -0.2931 -0.1034 -0.4582 0.0427 0.1130 0.0922 0.0928 0.0993 0.1005 0.0869 0.0960 0.0943 0.1213 0.1036 0.1020 0.0993 0.0957 0.0888 0.0928 0.0974 0.1194 0.0946 0.1303 0.1097 0.1204 0.1334 0.1115 0.2875
va: 2.1225 2.0251 2.0624 3.7654 3.8004 3.8450 3.8959 3.8948 3.8394 4.1241 3.6887 3.8003 3.9266 3.9529 3.9008 3.6757 3.5196 4.0627 3.9325 3.8863 3.8297 3.5383 1.0022 1.0309 1.0190 0.9987 1.0001 1.0044 1.0024 1.0025 1.0027 1.0298 1.0284 1.0242 0.9952 1.0081 0.9960 1.0001 0.9981 0.9959 0.9878 1.0021 1.0117 0.9883 1.0210 0.9469
dispcorr: -0.023413985 hartree
energy: -964.193143531689
dipole: -20.92947 19.45355 -1.47592 6.36886 -6.02865 0.34021 -14.42324 13.12921 -1.29403
magnitude: 1.99213 au
magnitude: 5.06360 debye
