program: Orca
programVersion: 5.0.2
elementType: O O O C C C C C C C C C C C C C C C C C C C H H H H H H H H H H H H H H H H H H H H H H H H
charge: 0
multiplicity: 1
keywords: wb97x-d3
keywords: def2-TZVPP
keywords: def2/J RIJCOSX
keywords: DEFGRID2
keywords: scfconv7
keywords: smallprint printgap noloewdin
keywords: NOSOSCF
formula: C19H24O3
InChI: InChI=1/C19H24O3/c1-7-8-13-12(4)16(10-15(13)20)22-18(21)17-14(9-11(2)3)19(17,5)6/h1,9,14,16-17H,8,10H2,2-6H3
46 atoms
O  -0.091525 -0.71641 1.154942
O  -1.357027 1.129663 1.165659
O  4.099049 -1.445923 2.90463
C  -3.624322 -0.64273 0.022349
C  -2.789308 -0.366056 -1.188619
C  -2.133243 -0.881181 0.103746
C  -4.300731 0.474413 0.77815
C  -4.457104 -1.903806 -0.009717
C  -2.538305 0.98706 -1.714424
C  -1.199926 -0.027397 0.857286
C  -2.36309 1.272201 -3.009526
C  0.980785 -0.063357 1.838368
C  -2.138469 2.683335 -3.459455
C  -2.389575 0.234012 -4.100456
C  1.709871 -1.056672 2.732401
C  2.021849 0.417901 0.856416
C  3.241741 -0.04269 1.170015
C  3.16261 -0.921731 2.341972
C  1.66156 1.314224 -0.267987
C  4.537116 0.253057 0.473919
C  4.588404 -0.314977 -0.867886
C  4.617531 -0.773213 -1.978281
H  -2.829552 -1.139539 -1.948094
H  -1.826408 -1.919622 0.059187
H  -5.293961 0.640916 0.357781
H  -4.433431 0.201346 1.826204
H  -3.773769 1.42231 0.750808
H  -4.666169 -2.260317 1.001138
H  -5.414401 -1.717567 -0.50091
H  -3.959467 -2.710561 -0.549644
H  -2.508627 1.808777 -1.009295
H  0.597574 0.782564 2.41348
H  1.383091 -2.081799 2.542265
H  1.570371 -0.861448 3.795997
H  -2.137175 3.387813 -2.627617
H  -1.184193 2.779765 -3.984543
H  -2.910556 2.998508 -4.166991
H  -2.118069 0.668321 -5.062679
H  -1.696117 -0.58753 -3.911205
H  -3.381939 -0.206464 -4.219995
H  2.536614 1.678234 -0.802996
H  1.094384 2.175066 0.089775
H  1.025914 0.794828 -0.989979
H  4.69411 1.333476 0.411686
H  5.368076 -0.140958 1.06396
H  4.649782 -1.180218 -2.96375
elementType: O C H
totalener: -964.16966849 hartree
nucrepener: 1779.07510500 hartree
electener: -2743.24477349 hartree
oneelecener: -4843.02621660 hartree
twoeener: 2099.78144311 hartree
cpcmener: -0.03014659 hartree
kineticenergy: 959.76338535 hartree
xcener: -94.695242414173 hartree
chargesum: -0.0000000
charge: -0.292578 -0.463474 -0.444571 0.101074 0.061398 -0.092172 -0.285232 -0.262737 -0.346621 0.375832 0.000704 0.241649 -0.224836 -0.290080 -0.132568 -0.017876 -0.087390 0.283540 -0.257388 -0.102797 -0.464435 0.049465 0.111875 0.094672 0.095220 0.100096 0.097091 0.093616 0.095130 0.086521 0.120890 0.104119 0.101829 0.099589 0.085108 0.095362 0.098872 0.095320 0.100337 0.106136 0.101862 0.120033 0.115509 0.133195 0.111332 0.287380
qa: -0.2926 -0.4635 -0.4446 0.1011 0.0614 -0.0922 -0.2852 -0.2627 -0.3466 0.3758 0.0007 0.2416 -0.2248 -0.2901 -0.1326 -0.0179 -0.0874 0.2835 -0.2574 -0.1028 -0.4644 0.0495 0.1119 0.0947 0.0952 0.1001 0.0971 0.0936 0.0951 0.0865 0.1209 0.1041 0.1018 0.0996 0.0851 0.0954 0.0989 0.0953 0.1003 0.1061 0.1019 0.1200 0.1155 0.1332 0.1113 0.2874
va: 2.1252 2.0309 2.0632 3.7381 3.7163 3.8637 3.8986 3.9054 3.9002 4.1273 3.6909 3.7810 3.9222 3.9481 3.9033 3.7116 3.5203 4.0613 3.9351 3.8837 3.8309 3.5297 0.9998 1.0296 1.0008 0.9993 1.0157 1.0026 1.0019 1.0050 1.0188 1.0293 1.0286 1.0239 1.0104 0.9932 0.9929 1.0048 0.9958 0.9947 1.0037 1.0083 0.9980 0.9881 1.0214 0.9468
dispcorr: -0.021848492 hartree
energy: -964.191516985321
dipole: -23.61762 22.03642 -1.58120 5.70525 -5.40198 0.30327 -17.20190 15.85791 -1.34399
magnitude: 2.09725 au
magnitude: 5.33080 debye
