program: Orca
programVersion: 5.0.2
elementType: O O O C C C C C C C C C C C C C C C C C C C H H H H H H H H H H H H H H H H H H H H H H H H
charge: 0
multiplicity: 1
keywords: wb97x-d3
keywords: def2-TZVPP
keywords: def2/J RIJCOSX
keywords: DEFGRID2
keywords: scfconv7
keywords: smallprint printgap noloewdin
keywords: NOSOSCF
formula: C19H24O3
InChI: InChI=1/C19H24O3/c1-7-8-13-12(4)16(10-15(13)20)22-18(21)17-14(9-11(2)3)19(17,5)6/h1,9,14,16-17H,8,10H2,2-6H3
46 atoms
O  -0.124711 -0.7192 1.144461
O  -1.366292 1.143255 1.170443
O  4.079364 -1.538751 2.798835
C  -3.666923 -0.592378 0.04796
C  -2.837491 -0.328604 -1.16871
C  -2.179598 -0.857058 0.117912
C  -4.318321 0.528572 0.820299
C  -4.519618 -1.840493 0.016724
C  -2.56543 1.019601 -1.699375
C  -1.226326 -0.014768 0.857976
C  -2.22824 1.285111 -2.966789
C  0.959688 -0.086977 1.827405
C  -2.035613 2.696831 -3.431581
C  -2.047761 0.236664 -4.028244
C  1.693824 -1.109431 2.68428
C  1.991902 0.413588 0.844421
C  3.211713 -0.067003 1.127116
C  3.141062 -0.980443 2.273128
C  1.625209 1.341976 -0.251503
C  4.499648 0.233279 0.419225
C  4.554454 -0.363841 -0.909872
C  4.585898 -0.853919 -2.006659
H  -2.899788 -1.102841 -1.925217
H  -1.888416 -1.899864 0.070834
H  -3.782859 1.471903 0.787989
H  -5.318964 0.705891 0.421138
H  -4.432219 0.251548 1.870051
H  -4.042382 -2.649351 -0.538294
H  -4.718967 -2.203634 1.027108
H  -5.481021 -1.635508 -0.458509
H  -2.675548 1.859757 -1.024068
H  0.589112 0.746058 2.429422
H  1.352909 -2.125674 2.472728
H  1.573568 -0.94127 3.754791
H  -2.218307 3.422615 -2.639193
H  -1.019946 2.852269 -3.805184
H  -2.706744 2.929843 -4.262977
H  -1.668501 -0.707967 -3.642718
H  -2.991053 0.025303 -4.537775
H  -1.351227 0.57656 -4.794928
H  0.964867 0.85183 -0.971722
H  2.4961 1.700783 -0.796883
H  1.082204 2.204812 0.137383
H  4.639151 1.313944 0.330111
H  5.339276 -0.133471 1.014474
H  4.613635 -1.291382 -2.979175
elementType: O C H
totalener: -964.17028816 hartree
nucrepener: 1782.90631608 hartree
electener: -2747.07660423 hartree
oneelecener: -4850.71328828 hartree
twoeener: 2103.63668405 hartree
cpcmener: -0.03064337 hartree
kineticenergy: 959.76379881 hartree
xcener: -94.695375395771 hartree
chargesum: -0.0000000
charge: -0.291782 -0.463931 -0.444748 0.099570 0.043585 -0.075872 -0.285732 -0.263544 -0.328322 0.370389 -0.006815 0.241195 -0.220604 -0.289226 -0.132506 -0.016931 -0.088902 0.284782 -0.256585 -0.105518 -0.461365 0.047893 0.110002 0.093883 0.096832 0.095015 0.100087 0.086354 0.094157 0.095423 0.121204 0.104348 0.101652 0.099639 0.086415 0.091939 0.097869 0.096968 0.109773 0.094849 0.114129 0.101782 0.120274 0.133164 0.111813 0.287396
qa: -0.2918 -0.4639 -0.4447 0.0996 0.0436 -0.0759 -0.2857 -0.2635 -0.3283 0.3704 -0.0068 0.2412 -0.2206 -0.2892 -0.1325 -0.0169 -0.0889 0.2848 -0.2566 -0.1055 -0.4614 0.0479 0.1100 0.0939 0.0968 0.0950 0.1001 0.0864 0.0942 0.0954 0.1212 0.1043 0.1017 0.0996 0.0864 0.0919 0.0979 0.0970 0.1098 0.0948 0.1141 0.1018 0.1203 0.1332 0.1118 0.2874
va: 2.1245 2.0296 2.0629 3.7558 3.7302 3.8414 3.8949 3.9026 3.9036 4.1290 3.7173 3.7836 3.9263 3.9485 3.9017 3.7152 3.5201 4.0630 3.9362 3.8831 3.8318 3.5320 1.0016 1.0299 1.0175 1.0006 0.9991 1.0049 1.0025 1.0020 1.0160 1.0283 1.0290 1.0237 1.0096 0.9959 0.9939 1.0001 0.9931 1.0014 0.9983 1.0044 1.0077 0.9881 1.0204 0.9468
dispcorr: -0.021953192 hartree
energy: -964.192241346947
dipole: -23.01278 21.42015 -1.59263 6.09334 -5.72847 0.36486 -16.75084 15.45516 -1.29568
magnitude: 2.08528 au
magnitude: 5.30036 debye
