program: Orca
programVersion: 5.0.2
elementType: O O O C C C C C C C C C C C C C C C C C C C H H H H H H H H H H H H H H H H H H H H H H H H
charge: 0
multiplicity: 1
keywords: wb97x-d3
keywords: def2-TZVPP
keywords: def2/J RIJCOSX
keywords: DEFGRID2
keywords: scfconv7
keywords: smallprint printgap noloewdin
keywords: NOSOSCF
formula: C19H24O3
InChI: InChI=1/C19H24O3/c1-7-8-13-12(4)16(10-15(13)20)22-18(21)17-14(9-11(2)3)19(17,5)6/h1,9,14,16-17H,8,10H2,2-6H3
46 atoms
O  -0.140312 -0.72482 1.110639
O  -1.363573 1.149247 1.088024
O  4.069456 -1.497993 2.791591
C  -3.697269 -0.615481 0.072442
C  -2.903942 -0.334181 -1.161595
C  -2.205441 -0.870009 0.101192
C  -4.335112 0.492471 0.873962
C  -4.5411 -1.869635 0.054457
C  -2.659059 1.025627 -1.680501
C  -1.239244 -0.020201 0.813668
C  -2.192593 1.308921 -2.902039
C  0.946892 -0.081952 1.779058
C  -2.039653 2.729894 -3.3528
C  -1.810646 0.278784 -3.924133
C  1.681583 -1.088538 2.653934
C  1.979752 0.403892 0.789961
C  3.201324 -0.062105 1.089181
C  3.130622 -0.955159 2.250681
C  1.616672 1.3094 -0.325907
C  4.489778 0.239388 0.382907
C  4.566101 -0.402386 -0.923962
C  4.608178 -0.917701 -2.009039
H  -2.978174 -1.100615 -1.925112
H  -1.90909 -1.91072 0.041827
H  -4.451685 0.187438 1.915589
H  -3.787257 1.429423 0.86862
H  -5.333519 0.692761 0.480248
H  -4.706844 -2.244759 1.066557
H  -5.51815 -1.666249 -0.388691
H  -4.075919 -2.669136 -0.523892
H  -2.907493 1.860071 -1.035213
H  0.577317 0.761257 2.367382
H  1.346717 -2.10954 2.455772
H  1.555209 -0.905346 3.72131
H  -0.996251 2.954719 -3.589571
H  -2.609127 2.916335 -4.267771
H  -2.374622 3.442141 -2.598708
H  -2.613743 0.133959 -4.652893
H  -0.936073 0.604529 -4.491207
H  -1.575914 -0.694481 -3.495888
H  1.076889 2.183198 0.042439
H  0.955253 0.805173 -1.035256
H  2.489532 1.652196 -0.87848
H  4.609418 1.319148 0.260106
H  5.331293 -0.092032 0.99599
H  4.662471 -1.391355 -2.963439
elementType: O C H
totalener: -964.17055085 hartree
nucrepener: 1786.28077876 hartree
electener: -2750.45132961 hartree
oneelecener: -4857.48707233 hartree
twoeener: 2107.03574273 hartree
cpcmener: -0.03089412 hartree
kineticenergy: 959.76173647 hartree
xcener: -94.694999433503 hartree
chargesum: 0.0000000
charge: -0.292834 -0.466105 -0.444861 0.103830 0.018350 -0.065797 -0.288639 -0.262001 -0.302756 0.369193 -0.017712 0.242025 -0.222452 -0.282256 -0.131226 -0.015085 -0.090632 0.284678 -0.259795 -0.104596 -0.459534 0.046475 0.109283 0.093449 0.099686 0.096626 0.097001 0.094647 0.095386 0.086774 0.121440 0.104224 0.101749 0.099236 0.092265 0.096016 0.087036 0.109009 0.095015 0.094325 0.120614 0.114551 0.101217 0.132448 0.112396 0.287335
qa: -0.2928 -0.4661 -0.4449 0.1038 0.0184 -0.0658 -0.2886 -0.2620 -0.3028 0.3692 -0.0177 0.2420 -0.2225 -0.2823 -0.1312 -0.0151 -0.0906 0.2847 -0.2598 -0.1046 -0.4595 0.0465 0.1093 0.0934 0.0997 0.0966 0.0970 0.0946 0.0954 0.0868 0.1214 0.1042 0.1017 0.0992 0.0923 0.0960 0.0870 0.1090 0.0950 0.0943 0.1206 0.1146 0.1012 0.1324 0.1124 0.2873
va: 2.1254 2.0242 2.0627 3.7723 3.7429 3.8425 3.8921 3.8980 3.8939 4.1223 3.7277 3.7848 3.9281 3.9468 3.9003 3.7127 3.5213 4.0648 3.9385 3.8841 3.8324 3.5331 1.0024 1.0302 0.9991 1.0198 0.9998 1.0027 1.0021 1.0048 1.0126 1.0284 1.0288 1.0241 0.9963 0.9949 1.0095 0.9943 0.9990 1.0029 1.0074 0.9973 1.0049 0.9888 1.0196 0.9468
dispcorr: -0.022086363 hartree
energy: -964.192637210816
dipole: -22.62480 21.03811 -1.58669 6.07019 -5.72328 0.34691 -16.24013 14.95876 -1.28138
magnitude: 2.06878 au
magnitude: 5.25843 debye
