program: Orca
programVersion: 5.0.2
elementType: O O O C C C C C C C C C C C C C C C C C C C H H H H H H H H H H H H H H H H H H H H H H H H
charge: 0
multiplicity: 1
keywords: wb97x-d3
keywords: def2-TZVPP
keywords: def2/J RIJCOSX
keywords: DEFGRID2
keywords: scfconv7
keywords: smallprint printgap noloewdin
keywords: NOSOSCF
formula: C19H24O3
InChI: InChI=1/C19H24O3/c1-7-8-13-12(4)16(10-15(13)20)22-18(21)17-14(9-11(2)3)19(17,5)6/h1,9,14,16-17H,8,10H2,2-6H3
46 atoms
O  -0.66573 0.118896 0.879949
O  -1.580883 -1.215138 2.40943
O  3.254409 -1.947432 -0.068701
C  -3.488423 0.776775 -0.063367
C  -2.965106 -0.342266 -0.896187
C  -2.937807 -0.455444 0.634148
C  -2.780772 2.107913 -0.006653
C  -4.990773 0.916945 0.029279
C  -1.733601 -0.224154 -1.715477
C  -1.68599 -0.55046 1.402806
C  -1.014686 -1.256764 -2.161491
C  0.627587 -0.052566 1.46255
C  0.198063 -1.049741 -3.015725
C  -1.344524 -2.68246 -1.839874
C  1.242771 -1.421394 1.186112
C  1.521949 0.931576 0.755815
C  2.547431 0.324115 0.144025
C  2.469014 -1.126422 0.352334
C  1.21294 2.382812 0.767554
C  3.637068 0.963135 -0.665056
C  4.537996 1.776604 0.14282
C  5.270182 2.457583 0.809506
H  -3.726651 -0.987432 -1.326448
H  -3.6943 -1.106269 1.057132
H  -2.952346 2.593263 0.956214
H  -1.707184 2.052271 -0.159977
H  -3.184821 2.766056 -0.778753
H  -5.37058 1.523074 -0.795866
H  -5.494114 -0.050053 -0.01251
H  -5.283481 1.403929 0.961755
H  -1.417164 0.777741 -1.989599
H  0.584008 0.172966 2.531872
H  0.573211 -2.086387 0.635966
H  1.530423 -1.940974 2.101181
H  1.093117 -1.441514 -2.523615
H  0.111275 -1.585263 -3.965417
H  0.370305 0.003425 -3.238787
H  -0.440966 -3.248808 -1.602914
H  -2.030968 -2.782801 -1.000061
H  -1.801636 -3.181598 -2.699801
H  2.1155 2.9919 0.724619
H  0.647982 2.66545 1.65577
H  0.603907 2.646962 -0.101399
H  4.214369 0.18839 -1.175693
H  3.202233 1.586712 -1.451485
H  5.924662 3.056693 1.402044
elementType: O C H
totalener: -964.16621636 hartree
nucrepener: 1871.21816834 hartree
electener: -2835.38438470 hartree
oneelecener: -5026.83333564 hartree
twoeener: 2191.44895094 hartree
cpcmener: -0.03274786 hartree
kineticenergy: 959.77568974 hartree
xcener: -94.697261012454 hartree
chargesum: 0.0000000
charge: -0.260654 -0.469206 -0.446968 0.141422 -0.022353 -0.139274 -0.272729 -0.269381 -0.232376 0.393415 -0.037997 0.230297 -0.233688 -0.284870 -0.141207 -0.031929 -0.089686 0.285248 -0.300300 -0.108925 -0.472042 0.071111 0.113968 0.093775 0.104173 0.062403 0.101285 0.094108 0.086772 0.096503 0.120547 0.112690 0.105724 0.115587 0.086148 0.106198 0.089897 0.093553 0.097528 0.116092 0.117795 0.116188 0.128408 0.112580 0.134213 0.285955
qa: -0.2607 -0.4692 -0.4470 0.1414 -0.0224 -0.1393 -0.2727 -0.2694 -0.2324 0.3934 -0.0380 0.2303 -0.2337 -0.2849 -0.1412 -0.0319 -0.0897 0.2852 -0.3003 -0.1089 -0.4720 0.0711 0.1140 0.0938 0.1042 0.0624 0.1013 0.0941 0.0868 0.0965 0.1205 0.1127 0.1057 0.1156 0.0861 0.1062 0.0899 0.0936 0.0975 0.1161 0.1178 0.1162 0.1284 0.1126 0.1342 0.2860
va: 2.1031 2.0389 2.0526 3.7466 3.7834 3.8734 3.9075 3.9045 3.8220 4.1388 3.6988 3.7536 3.9237 3.9431 3.8840 3.7251 3.4925 4.0236 3.9515 3.8819 3.8619 3.5091 1.0027 1.0275 1.0012 1.0103 1.0008 1.0021 1.0051 1.0017 1.0014 1.0153 1.0204 1.0202 1.0004 0.9977 1.0063 0.9989 1.0022 0.9978 1.0023 1.0028 0.9870 1.0201 0.9892 0.9474
dispcorr: -0.026547437 hartree
energy: -964.192763795849
dipole: -15.40214 14.00349 -1.39865 5.66694 -3.69957 1.96736 -10.71859 9.97382 -0.74477
magnitude: 2.52615 au
magnitude: 6.42096 debye
