program: Orca
programVersion: 5.0.2
elementType: O O O C C C C C C C C C C C C C C C C C C C H H H H H H H H H H H H H H H H H H H H H H H H
charge: 0
multiplicity: 1
keywords: wb97x-d3
keywords: def2-TZVPP
keywords: def2/J RIJCOSX
keywords: DEFGRID2
keywords: scfconv7
keywords: smallprint printgap noloewdin
keywords: NOSOSCF
formula: C19H24O3
InChI: InChI=1/C19H24O3/c1-7-8-13-12(4)16(10-15(13)20)22-18(21)17-14(9-11(2)3)19(17,5)6/h1,9,14,16-17H,8,10H2,2-6H3
46 atoms
O  -0.149928 -0.722037 1.090015
O  -1.366226 1.156326 1.056183
O  4.0572 -1.494656 2.782189
C  -3.712073 -0.611628 0.076856
C  -2.934893 -0.326097 -1.165385
C  -2.219172 -0.865536 0.086132
C  -4.339747 0.493206 0.890894
C  -4.555622 -1.866038 0.066855
C  -2.694142 1.037151 -1.679384
C  -1.246534 -0.015294 0.788932
C  -2.170716 1.332125 -2.874716
C  0.938233 -0.079212 1.756821
C  -2.016997 2.757482 -3.3118
C  -1.7033 0.318834 -3.875911
C  1.66987 -1.08392 2.636373
C  1.973976 0.400255 0.767364
C  3.194857 -0.063158 1.073305
C  3.119981 -0.953664 2.236495
C  1.613871 1.296895 -0.356393
C  4.48556 0.232701 0.368809
C  4.576861 -0.444274 -0.919148
C  4.628113 -1.003273 -1.982481
H  -3.017435 -1.089878 -1.930813
H  -1.922951 -1.906015 0.021876
H  -4.446161 0.182428 1.932047
H  -3.789788 1.4289 0.885597
H  -5.341801 0.698086 0.508814
H  -4.09736 -2.664291 -0.518721
H  -4.708965 -2.243169 1.080128
H  -5.538032 -1.662093 -0.363997
H  -2.993466 1.866558 -1.049208
H  0.570103 0.767152 2.341655
H  1.336629 -2.10535 2.437638
H  1.538456 -0.899849 3.703054
H  -2.402475 3.460496 -2.573434
H  -0.966074 3.0001 -3.49107
H  -2.539797 2.939904 -4.254895
H  -1.620622 -0.690073 -3.475987
H  -2.379615 0.2817 -4.734693
H  -0.722723 0.595164 -4.270597
H  2.488738 1.641222 -0.904855
H  1.065797 2.169621 0.002011
H  0.961382 0.783157 -1.066974
H  4.595162 1.309544 0.215635
H  5.325641 -0.072288 0.997471
H  4.678928 -1.498074 -2.925983
elementType: O C H
totalener: -964.17078138 hartree
nucrepener: 1787.96492289 hartree
electener: -2752.13570427 hartree
oneelecener: -4860.84836572 hartree
twoeener: 2108.71266145 hartree
cpcmener: -0.03113926 hartree
kineticenergy: 959.75973329 hartree
xcener: -94.694783293469 hartree
chargesum: -0.0000000
charge: -0.293200 -0.466369 -0.444911 0.109933 0.001971 -0.063442 -0.289530 -0.261161 -0.281697 0.368221 -0.030431 0.242500 -0.225051 -0.272177 -0.130709 -0.014940 -0.090408 0.284507 -0.261128 -0.105765 -0.455684 0.041973 0.108163 0.093272 0.099794 0.096030 0.097678 0.086868 0.094828 0.095375 0.121410 0.104305 0.101620 0.099358 0.088028 0.092760 0.095093 0.091540 0.107110 0.093561 0.102173 0.120495 0.115055 0.132870 0.112377 0.287738
qa: -0.2932 -0.4664 -0.4449 0.1099 0.0020 -0.0634 -0.2895 -0.2612 -0.2817 0.3682 -0.0304 0.2425 -0.2251 -0.2722 -0.1307 -0.0149 -0.0904 0.2845 -0.2611 -0.1058 -0.4557 0.0420 0.1082 0.0933 0.0998 0.0960 0.0977 0.0869 0.0948 0.0954 0.1214 0.1043 0.1016 0.0994 0.0880 0.0928 0.0951 0.0915 0.1071 0.0936 0.1022 0.1205 0.1151 0.1329 0.1124 0.2877
va: 2.1260 2.0229 2.0626 3.7748 3.7553 3.8437 3.8916 3.8960 3.8796 4.1201 3.7391 3.7858 3.9279 3.9452 3.8988 3.7144 3.5202 4.0657 3.9387 3.8852 3.8322 3.5394 1.0036 1.0301 0.9992 1.0205 0.9997 1.0048 1.0027 1.0021 1.0110 1.0284 1.0289 1.0240 1.0091 0.9965 0.9956 1.0065 0.9956 0.9981 1.0048 1.0076 0.9964 0.9884 1.0193 0.9466
dispcorr: -0.022174938 hartree
energy: -964.192956314758
dipole: -22.39600 20.81599 -1.58001 6.18387 -5.82625 0.35763 -16.00049 14.72208 -1.27840
magnitude: 2.06365 au
magnitude: 5.24538 debye
