program: Orca
programVersion: 5.0.2
elementType: O O O C C C C C C C C C C C C C C C C C C C H H H H H H H H H H H H H H H H H H H H H H H H
charge: 0
multiplicity: 1
keywords: wb97x-d3
keywords: def2-TZVPP
keywords: def2/J RIJCOSX
keywords: DEFGRID2
keywords: scfconv7
keywords: smallprint printgap noloewdin
keywords: NOSOSCF
formula: C19H24O3
InChI: InChI=1/C19H24O3/c1-7-8-13-12(4)16(10-15(13)20)22-18(21)17-14(9-11(2)3)19(17,5)6/h1,9,14,16-17H,8,10H2,2-6H3
46 atoms
O  -0.651719 0.118759 0.900685
O  -1.584847 -1.267236 2.371822
O  3.176538 -1.922266 -0.273437
C  -3.432787 0.811985 -0.105965
C  -2.954961 -0.350109 -0.905704
C  -2.929585 -0.417787 0.628897
C  -2.676117 2.11741 -0.106919
C  -4.928504 1.011865 -0.010712
C  -1.723579 -0.299965 -1.731695
C  -1.680157 -0.560037 1.39324
C  -1.042787 -1.375348 -2.135008
C  0.639391 -0.093633 1.476259
C  0.151008 -1.254116 -3.030164
C  -1.427655 -2.769865 -1.738483
C  1.23942 -1.448326 1.110996
C  1.539181 0.923332 0.822786
C  2.528038 0.342108 0.130137
C  2.427134 -1.117736 0.236848
C  1.307156 2.376275 1.006238
C  3.609382 1.024896 -0.652964
C  4.448257 1.87621 0.180868
C  5.121519 2.584128 0.880794
H  -3.738453 -0.983082 -1.314928
H  -3.712132 -1.027812 1.065104
H  -2.819603 2.647255 0.836801
H  -1.60758 2.016798 -0.272266
H  -3.066445 2.757779 -0.901001
H  -5.197495 1.532335 0.910754
H  -5.289825 1.611451 -0.848791
H  -5.468562 0.064169 -0.026216
H  -1.384885 0.678534 -2.058458
H  0.595541 0.06687 2.557106
H  0.54522 -2.094863 0.570366
H  1.571806 -2.002394 1.99038
H  0.359216 -0.2190 -3.30186
H  1.045197 -1.666077 -2.554272
H  0.007301 -1.821481 -3.95431
H  -1.938928 -2.809281 -0.776197
H  -2.099027 -3.21635 -2.478661
H  -0.553342 -3.420503 -1.680368
H  1.842825 2.725259 1.893647
H  0.253107 2.603976 1.161733
H  1.666029 2.959704 0.158951
H  4.231853 0.277638 -1.150772
H  3.167676 1.630924 -1.449848
H  5.723401 3.206071 1.504549
elementType: O C H
totalener: -964.16634820 hartree
nucrepener: 1872.22580456 hartree
electener: -2836.39215275 hartree
oneelecener: -5028.96068950 hartree
twoeener: 2192.56853675 hartree
cpcmener: -0.03226175 hartree
kineticenergy: 959.77496516 hartree
xcener: -94.697241509331 hartree
chargesum: 0.0000000
charge: -0.261971 -0.470332 -0.446433 0.148901 -0.023783 -0.136972 -0.294733 -0.268552 -0.238814 0.386846 -0.036379 0.232848 -0.231688 -0.293180 -0.135820 -0.027042 -0.073951 0.263797 -0.283237 -0.112455 -0.454178 0.050014 0.113505 0.093632 0.105876 0.078034 0.102369 0.096643 0.093808 0.086813 0.122937 0.112792 0.104606 0.117042 0.089255 0.086364 0.107523 0.099601 0.118848 0.097410 0.126716 0.107211 0.112384 0.112217 0.135001 0.286528
qa: -0.2620 -0.4703 -0.4464 0.1489 -0.0238 -0.1370 -0.2947 -0.2686 -0.2388 0.3868 -0.0364 0.2328 -0.2317 -0.2932 -0.1358 -0.0270 -0.0740 0.2638 -0.2832 -0.1125 -0.4542 0.0500 0.1135 0.0936 0.1059 0.0780 0.1024 0.0966 0.0938 0.0868 0.1229 0.1128 0.1046 0.1170 0.0893 0.0864 0.1075 0.0996 0.1188 0.0974 0.1267 0.1072 0.1124 0.1122 0.1350 0.2865
va: 2.1062 2.0356 2.0511 3.7256 3.7870 3.8742 3.9079 3.9025 3.8086 4.1471 3.6964 3.7693 3.9176 3.9412 3.8717 3.7171 3.4883 4.0302 3.9427 3.8878 3.8342 3.5316 1.0021 1.0282 0.9991 1.0044 1.0007 1.0017 1.0025 1.0052 1.0001 1.0157 1.0210 1.0188 1.0069 1.0033 0.9966 1.0003 0.9974 1.0003 0.9942 1.0104 0.9941 1.0213 0.9882 0.9472
dispcorr: -0.026482399 hartree
energy: -964.192830596635
dipole: -14.99384 13.71190 -1.28195 5.35323 -3.40545 1.94778 -9.98547 9.47994 -0.50553
magnitude: 2.38596 au
magnitude: 6.06462 debye
