program: Orca
programVersion: 5.0.2
elementType: O O O C C C C C C C C C C C C C C C C C C C H H H H H H H H H H H H H H H H H H H H H H H H
charge: 0
multiplicity: 1
keywords: wb97x-d3
keywords: def2-TZVPP
keywords: def2/J RIJCOSX
keywords: DEFGRID2
keywords: scfconv7
keywords: smallprint printgap noloewdin
keywords: NOSOSCF
formula: C19H24O3
InChI: InChI=1/C19H24O3/c1-7-8-13-12(4)16(10-15(13)20)22-18(21)17-14(9-11(2)3)19(17,5)6/h1,9,14,16-17H,8,10H2,2-6H3
46 atoms
O  0.263065 -0.546861 0.669383
O  -1.405669 0.9088 1.005768
O  4.162465 -0.968239 3.101356
C  -3.156736 -1.385853 -0.216232
C  -2.799165 -0.529352 -1.390678
C  -1.704741 -0.996621 -0.430679
C  -3.959564 -0.822447 0.929573
C  -3.466419 -2.837402 -0.495304
C  -3.21541 0.880749 -1.52503
C  -0.98204 -0.091777 0.479328
C  -3.797769 1.420037 -2.602698
C  1.165013 0.159639 1.520671
C  -4.178717 2.870731 -2.617405
C  -4.136024 0.686255 -3.864776
C  1.808905 -0.775295 2.535377
C  2.309052 0.691401 0.696541
C  3.493877 0.331165 1.210251
C  3.291556 -0.529195 2.381999
C  2.046727 1.513336 -0.507305
C  4.85981 0.685984 0.705609
C  5.275573 -0.194957 -0.379343
C  5.595441 -0.926241 -1.277909
H  -2.746244 -1.071507 -2.328178
H  -1.079143 -1.789322 -0.823526
H  -5.022248 -0.98302 0.736835
H  -3.716692 -1.337486 1.861211
H  -3.819123 0.242195 1.092799
H  -2.878973 -3.226903 -1.328016
H  -3.256533 -3.45832 0.378277
H  -4.521552 -2.963914 -0.746972
H  -3.045029 1.532993 -0.677338
H  0.649933 0.98855 2.011015
H  1.598352 -1.82116 2.298377
H  1.480429 -0.598791 3.559882
H  -3.6898 3.396038 -3.442603
H  -5.254437 2.994038 -2.770116
H  -3.910914 3.379348 -1.691269
H  -3.87963 -0.371017 -3.849171
H  -5.207523 0.758659 -4.070085
H  -3.630006 1.13851 -4.721922
H  1.650504 0.890318 -1.313073
H  2.945229 2.001814 -0.880466
H  1.294789 2.277838 -0.302332
H  4.884834 1.72209 0.360021
H  5.583773 0.616809 1.521369
H  5.874319 -1.566768 -2.083894
elementType: O C H
totalener: -964.17089383 hartree
nucrepener: 1748.42319269 hartree
electener: -2712.59408651 hartree
oneelecener: -4781.66061096 hartree
twoeener: 2069.06652444 hartree
cpcmener: -0.03186396 hartree
kineticenergy: 959.76341681 hartree
xcener: -94.695150019557 hartree
chargesum: 0.0000000
charge: -0.297499 -0.470069 -0.444351 0.110915 0.027807 -0.118107 -0.284041 -0.261382 -0.297450 0.408942 -0.044415 0.244098 -0.221305 -0.254655 -0.136361 -0.022317 -0.093150 0.294375 -0.252802 -0.113854 -0.443537 0.038487 0.113797 0.095875 0.097158 0.102316 0.096148 0.086927 0.093482 0.094517 0.124515 0.104481 0.099909 0.099687 0.091996 0.092622 0.088903 0.087948 0.095453 0.095741 0.113294 0.106455 0.116650 0.131226 0.114672 0.286901
qa: -0.2975 -0.4701 -0.4444 0.1109 0.0278 -0.1181 -0.2840 -0.2614 -0.2975 0.4089 -0.0444 0.2441 -0.2213 -0.2547 -0.1364 -0.0223 -0.0931 0.2944 -0.2528 -0.1139 -0.4435 0.0385 0.1138 0.0959 0.0972 0.1023 0.0961 0.0869 0.0935 0.0945 0.1245 0.1045 0.0999 0.0997 0.0920 0.0926 0.0889 0.0879 0.0955 0.0957 0.1133 0.1065 0.1167 0.1312 0.1147 0.2869
va: 2.1239 2.0303 2.0624 3.7111 3.7406 3.8941 3.9115 3.9101 3.8531 4.1016 3.7740 3.7667 3.9243 3.9401 3.8991 3.7270 3.5184 4.0641 3.9353 3.8865 3.8316 3.5450 1.0048 1.0311 1.0015 0.9992 1.0133 1.0052 1.0024 1.0018 1.0240 1.0362 1.0283 1.0247 0.9960 0.9966 1.0088 1.0129 0.9972 0.9969 1.0013 1.0024 1.0047 0.9904 1.0156 0.9471
dispcorr: -0.020911824 hartree
energy: -964.191805651288
dipole: -27.79687 26.30456 -1.49231 2.95675 -2.68605 0.27070 -16.13792 14.41138 -1.72654
magnitude: 2.29809 au
magnitude: 5.84128 debye
