program: Orca
programVersion: 5.0.2
elementType: O O O C C C C C C C C C C C C C C C C C C C H H H H H H H H H H H H H H H H H H H H H H H H
charge: 0
multiplicity: 1
keywords: wb97x-d3
keywords: def2-TZVPP
keywords: def2/J RIJCOSX
keywords: DEFGRID2
keywords: scfconv7
keywords: smallprint printgap noloewdin
keywords: NOSOSCF
formula: C19H24O3
InChI: InChI=1/C19H24O3/c1-7-8-13-12(4)16(10-15(13)20)22-18(21)17-14(9-11(2)3)19(17,5)6/h1,9,14,16-17H,8,10H2,2-6H3
46 atoms
O  -0.381011 -0.804485 1.091569
O  -1.497862 1.069293 1.590074
O  3.685376 -2.49389 1.600358
C  -3.862743 -0.060737 -0.048536
C  -2.825813 -0.135636 -1.123217
C  -2.527875 -0.671874 0.283161
C  -4.310631 1.271309 0.503183
C  -4.996919 -1.056556 -0.142463
C  -2.120539 1.058351 -1.650935
C  -1.458171 -0.014476 1.061974
C  -0.97355 1.00297 -2.335461
C  0.767683 -0.430841 1.865947
C  -0.350022 2.231179 -2.922634
C  -0.23471 -0.275353 -2.590197
C  1.495686 -1.701639 2.283021
C  1.761385 0.325784 1.011821
C  2.89078 -0.374916 0.831341
C  2.819417 -1.647411 1.559534
C  1.4613 1.68175 0.495289
C  4.106558 0.025401 0.047559
C  3.813793 0.327896 -1.347814
C  3.56276 0.595642 -2.492511
H  -2.963147 -0.933683 -1.847183
H  -2.501711 -1.754308 0.350563
H  -5.142662 1.646218 -0.096657
H  -4.671216 1.162619 1.527788
H  -3.540423 2.036936 0.507977
H  -5.795816 -0.670214 -0.778785
H  -4.671981 -2.009347 -0.56356
H  -5.424822 -1.258193 0.841753
H  -2.590834 2.026154 -1.50544
H  0.457194 0.169472 2.723719
H  0.946895 -2.608328 2.023852
H  1.673977 -1.73088 3.359649
H  -0.277175 2.148245 -4.010836
H  -0.917246 3.13335 -2.693113
H  0.671625 2.36883 -2.557345
H  0.838158 -0.141205 -2.434034
H  -0.562811 -1.096274 -1.954677
H  -0.355975 -0.592828 -3.630312
H  1.10694 2.323629 1.303668
H  0.665225 1.652588 -0.251731
H  2.330858 2.151196 0.040527
H  4.578851 0.897501 0.509774
H  4.847723 -0.776248 0.092723
H  3.339913 0.822282 -3.510985
elementType: O C H
totalener: -964.16699504 hartree
nucrepener: 1856.88813018 hartree
electener: -2821.05512522 hartree
oneelecener: -4998.71249495 hartree
twoeener: 2177.65736973 hartree
cpcmener: -0.02975045 hartree
kineticenergy: 959.76374237 hartree
xcener: -94.696059891121 hartree
chargesum: 0.0000000
charge: -0.272926 -0.451308 -0.444523 0.146127 -0.032464 -0.119421 -0.293043 -0.268393 -0.238396 0.371034 -0.037621 0.222364 -0.219197 -0.261263 -0.136976 -0.009238 -0.094191 0.285510 -0.263315 -0.090917 -0.431239 0.010229 0.107146 0.097678 0.097506 0.100646 0.087172 0.094531 0.085668 0.095922 0.124262 0.107145 0.099236 0.107076 0.104769 0.092775 0.079357 0.072246 0.093564 0.116704 0.124879 0.100085 0.107617 0.133755 0.110950 0.288476
qa: -0.2729 -0.4513 -0.4445 0.1461 -0.0325 -0.1194 -0.2930 -0.2684 -0.2384 0.3710 -0.0376 0.2224 -0.2192 -0.2613 -0.1370 -0.0092 -0.0942 0.2855 -0.2633 -0.0909 -0.4312 0.0102 0.1071 0.0977 0.0975 0.1006 0.0872 0.0945 0.0857 0.0959 0.1243 0.1071 0.0992 0.1071 0.1048 0.0928 0.0794 0.0722 0.0936 0.1167 0.1249 0.1001 0.1076 0.1338 0.1110 0.2885
va: 2.1142 2.0429 2.0628 3.7606 3.8171 3.8317 3.8978 3.8976 3.8162 4.1530 3.7257 3.7973 3.9125 3.9387 3.9112 3.6278 3.5298 4.0597 3.9372 3.8758 3.8162 3.5794 1.0043 1.0283 0.9994 1.0015 1.0156 1.0027 1.0040 1.0026 1.0021 1.0235 1.0314 1.0190 0.9947 1.0083 0.9997 1.0084 1.0131 1.0011 1.0104 1.0029 0.9987 0.9876 1.0218 0.9473
dispcorr: -0.026202367 hartree
energy: -964.193197403178
dipole: -16.74713 15.65869 -1.08844 8.43948 -7.77244 0.66704 -11.65858 11.22361 -0.43497
magnitude: 1.34865 au
magnitude: 3.42798 debye
