program: Orca
programVersion: 5.0.2
elementType: O O O C C C C C C C C C C C C C C C C C C C H H H H H H H H H H H H H H H H H H H H H H H H
charge: 0
multiplicity: 1
keywords: wb97x-d3
keywords: def2-TZVPP
keywords: def2/J RIJCOSX
keywords: DEFGRID2
keywords: scfconv7
keywords: smallprint printgap noloewdin
keywords: NOSOSCF
formula: C19H24O3
InChI: InChI=1/C19H24O3/c1-7-8-13-12(4)16(10-15(13)20)22-18(21)17-14(9-11(2)3)19(17,5)6/h1,9,14,16-17H,8,10H2,2-6H3
46 atoms
O  -0.354971 -0.944543 1.209853
O  -1.670153 0.443582 2.377592
O  4.075701 -2.051299 1.611294
C  -3.459059 0.150745 -0.182226
C  -2.5256 -0.779387 -0.924665
C  -2.602973 -0.8174 0.579247
C  -3.141039 1.624246 -0.133108
C  -4.936269 -0.14456 -0.25564
C  -1.320271 -0.306428 -1.656308
C  -1.513817 -0.34465 1.475726
C  -1.338077 0.371611 -2.807249
C  0.820585 -0.610648 1.958934
C  -0.06058 0.763208 -3.485535
C  -2.591714 0.79424 -3.50739
C  1.708504 -1.837662 2.105214
C  1.654288 0.388572 1.194729
C  2.903817 -0.059294 1.000061
C  3.050208 -1.400928 1.570635
C  1.095572 1.692814 0.766812
C  4.032505 0.659728 0.323097
C  3.747125 0.958863 -1.074636
C  3.483596 1.209495 -2.220475
H  -3.025185 -1.623604 -1.394489
H  -3.10916 -1.679071 1.009148
H  -3.559078 2.124694 -1.008117
H  -3.584996 2.087997 0.749462
H  -2.072662 1.837173 -0.120011
H  -5.133733 -1.216899 -0.289111
H  -5.462831 0.263242 0.609621
H  -5.375524 0.302235 -1.150228
H  -0.350706 -0.579463 -1.253158
H  0.541164 -0.198668 2.930602
H  1.340317 -2.675805 1.50947
H  1.793198 -2.182382 3.135839
H  0.021595 1.84996 -3.56988
H  0.814311 0.399487 -2.946585
H  -0.018387 0.370498 -4.504556
H  -2.618086 0.387438 -4.521631
H  -3.497393 0.474349 -2.994894
H  -2.62865 1.881306 -3.613844
H  0.495929 2.139255 1.560294
H  0.437667 1.562532 -0.097373
H  1.873124 2.399374 0.483214
H  4.250474 1.593841 0.848489
H  4.942238 0.058805 0.385355
H  3.258443 1.43696 -3.238149
elementType: O C H
totalener: -964.15528347 hartree
nucrepener: 1846.42126880 hartree
electener: -2810.57655227 hartree
oneelecener: -4977.31929481 hartree
twoeener: 2166.74274253 hartree
cpcmener: -0.03782037 hartree
kineticenergy: 959.76772461 hartree
xcener: -94.698064865414 hartree
chargesum: 0.0000000
charge: -0.280517 -0.472786 -0.479737 0.083885 -0.006224 -0.074746 -0.292651 -0.274347 -0.308462 0.386147 0.001777 0.234271 -0.232702 -0.271769 -0.136501 -0.014049 -0.083242 0.306804 -0.274624 -0.088373 -0.458617 0.022492 0.109257 0.110924 0.098165 0.106072 0.088953 0.088474 0.096416 0.089742 0.124742 0.114456 0.105228 0.104147 0.099134 0.074136 0.102781 0.108150 0.092610 0.100477 0.122456 0.115319 0.117477 0.135879 0.108818 0.300158
qa: -0.2805 -0.4728 -0.4797 0.0839 -0.0062 -0.0747 -0.2927 -0.2743 -0.3085 0.3861 0.0018 0.2343 -0.2327 -0.2718 -0.1365 -0.0140 -0.0832 0.3068 -0.2746 -0.0884 -0.4586 0.0225 0.1093 0.1109 0.0982 0.1061 0.0890 0.0885 0.0964 0.0897 0.1247 0.1145 0.1052 0.1041 0.0991 0.0741 0.1028 0.1082 0.0926 0.1005 0.1225 0.1153 0.1175 0.1359 0.1088 0.3002
va: 2.1278 2.0157 2.0198 3.7116 3.7678 3.8474 3.9101 3.8980 3.8483 4.1412 3.6767 3.7586 3.9317 3.9366 3.9311 3.6499 3.5275 4.0285 3.9231 3.8900 3.8598 3.5588 1.0057 1.0121 1.0012 1.0087 0.9961 1.0046 1.0021 1.0028 1.0108 1.0271 1.0264 1.0225 0.9946 1.0066 0.9998 1.0009 1.0054 0.9958 1.0120 0.9889 0.9992 0.9883 1.0222 0.9378
dispcorr: -0.026284498 hartree
energy: -964.181567971021
dipole: -19.36319 17.83633 -1.52685 10.44153 -9.55678 0.88475 -16.48988 15.63965 -0.85023
magnitude: 1.95882 au
magnitude: 4.97892 debye
