program: Orca
programVersion: 5.0.2
elementType: O O O C C C C C C C C C C C C C C C C C C C H H H H H H H H H H H H H H H H H H H H H H H H
charge: 0
multiplicity: 1
keywords: wb97x-d3
keywords: def2-TZVPP
keywords: def2/J RIJCOSX
keywords: DEFGRID2
keywords: scfconv7
keywords: smallprint printgap noloewdin
keywords: NOSOSCF
formula: C19H24O3
InChI: InChI=1/C19H24O3/c1-7-8-13-12(4)16(10-15(13)20)22-18(21)17-14(9-11(2)3)19(17,5)6/h1,9,14,16-17H,8,10H2,2-6H3
46 atoms
O  0.062533 -0.642244 0.931063
O  -1.289599 1.140175 0.85534
O  4.167589 -1.237033 2.881287
C  -3.471775 -0.938791 0.034871
C  -2.876077 -0.518805 -1.270906
C  -1.961713 -0.953454 -0.119714
C  -4.163103 0.057903 0.931273
C  -4.110079 -2.306941 0.08596
C  -2.930323 0.863081 -1.781007
C  -1.073729 -0.020543 0.590347
C  -3.123546 1.219997 -3.056911
C  1.057076 0.058801 1.681632
C  -3.183232 2.669157 -3.438187
C  -3.302198 0.278817 -4.208643
C  1.776346 -0.910502 2.610257
C  2.131686 0.606032 0.772515
C  3.350023 0.201606 1.161815
C  3.237906 -0.717771 2.29592
C  1.793408 1.497732 -0.360532
C  4.678474 0.562337 0.571529
C  5.102282 -0.407109 -0.431229
C  5.430018 -1.212771 -1.260891
H  -2.916192 -1.283759 -2.037817
H  -1.529177 -1.938424 -0.247716
H  -5.225134 0.085999 0.681072
H  -4.082757 -0.24795 1.975833
H  -3.785603 1.07284 0.852869
H  -5.151347 -2.254246 -0.237519
H  -3.59682 -3.020208 -0.559815
H  -4.097165 -2.705372 1.102178
H  -2.826656 1.664037 -1.059292
H  0.597135 0.876933 2.239972
H  1.495785 -1.946153 2.406298
H  1.576057 -0.720653 3.664939
H  -3.049236 3.328047 -2.580745
H  -2.412468 2.911418 -4.174476
H  -4.140988 2.912604 -3.905272
H  -3.246538 -0.77338 -3.939222
H  -4.269804 0.445419 -4.688548
H  -2.545574 0.465591 -4.974589
H  1.163315 0.978385 -1.085952
H  2.678451 1.851272 -0.885078
H  1.227801 2.363826 -0.012808
H  4.641527 1.554947 0.119065
H  5.430466 0.613512 1.362908
H  5.724971 -1.925982 -1.997037
elementType: O C H
totalener: -964.16135706 hartree
nucrepener: 1758.44230820 hartree
electener: -2722.60366526 hartree
oneelecener: -4801.85165246 hartree
twoeener: 2079.24798720 hartree
cpcmener: -0.03968287 hartree
kineticenergy: 959.76926376 hartree
xcener: -94.699214708361 hartree
chargesum: 0.0000000
charge: -0.299251 -0.496201 -0.480601 0.105236 0.036166 -0.100565 -0.287990 -0.262807 -0.301341 0.414352 -0.057411 0.253453 -0.218095 -0.254036 -0.136025 -0.022552 -0.099145 0.315960 -0.244878 -0.114689 -0.448355 0.036163 0.121451 0.096537 0.098220 0.103669 0.095087 0.095252 0.088569 0.093967 0.121177 0.106430 0.103570 0.102768 0.088597 0.093513 0.093453 0.089406 0.097083 0.096325 0.113041 0.104012 0.117913 0.130450 0.120578 0.291543
qa: -0.2993 -0.4962 -0.4806 0.1052 0.0362 -0.1006 -0.2880 -0.2628 -0.3013 0.4144 -0.0574 0.2535 -0.2181 -0.2540 -0.1360 -0.0226 -0.0991 0.3160 -0.2449 -0.1147 -0.4484 0.0362 0.1215 0.0965 0.0982 0.1037 0.0951 0.0953 0.0886 0.0940 0.1212 0.1064 0.1036 0.1028 0.0886 0.0935 0.0935 0.0894 0.0971 0.0963 0.1130 0.1040 0.1179 0.1304 0.1206 0.2915
va: 2.1282 1.9935 2.0172 3.7108 3.7261 3.8805 3.9045 3.9078 3.8481 4.0730 3.7935 3.7624 3.9200 3.9379 3.9144 3.7540 3.5279 4.0423 3.9373 3.8837 3.8184 3.5418 0.9999 1.0302 1.0008 0.9985 1.0135 1.0015 1.0054 1.0021 1.0222 1.0285 1.0287 1.0226 1.0088 0.9963 0.9963 1.0139 0.9968 0.9969 0.9998 1.0056 1.0042 0.9933 1.0093 0.9440
dispcorr: -0.021130110 hartree
energy: -964.182487170093
dipole: -26.45411 24.63288 -1.82123 4.56733 -4.23228 0.33505 -16.36403 14.96410 -1.39993
magnitude: 2.32141 au
magnitude: 5.90056 debye
