program: Orca
programVersion: 5.0.2
elementType: O O O C C C C C C C C C C C C C C C C C C C H H H H H H H H H H H H H H H H H H H H H H H H
charge: 0
multiplicity: 1
keywords: wb97x-d3
keywords: def2-TZVPP
keywords: def2/J RIJCOSX
keywords: DEFGRID2
keywords: scfconv7
keywords: smallprint printgap noloewdin
keywords: NOSOSCF
formula: C19H24O3
InChI: InChI=1/C19H24O3/c1-7-8-13-12(4)16(10-15(13)20)22-18(21)17-14(9-11(2)3)19(17,5)6/h1,9,14,16-17H,8,10H2,2-6H3
46 atoms
O  -0.174871 -0.735484 0.983716
O  -1.417173 1.130267 0.987536
O  4.007572 -1.506712 2.756602
C  -3.75135 -0.697297 0.066156
C  -3.05205 -0.297704 -1.18483
C  -2.247022 -0.8827 -0.014648
C  -4.374953 0.331013 0.977075
C  -4.532468 -1.990436 0.034735
C  -2.904222 1.113494 -1.615409
C  -1.283001 -0.036644 0.698079
C  -2.027552 1.534381 -2.531674
C  0.911313 -0.096886 1.658197
C  -1.97767 2.966378 -2.965781
C  -1.038115 0.631506 -3.201866
C  1.623452 -1.093197 2.562539
C  1.962415 0.357081 0.675677
C  3.177309 -0.104602 1.008478
C  3.078736 -0.97148 2.184245
C  1.619592 1.220223 -0.477372
C  4.476667 0.177901 0.315567
C  4.5676 -0.489224 -0.977668
C  4.620963 -1.034839 -2.047714
H  -3.128127 -1.010562 -2.000823
H  -1.915387 -1.904424 -0.154653
H  -3.889856 1.302268 0.959358
H  -5.416604 0.48122 0.687433
H  -4.372448 -0.023028 2.009352
H  -4.59451 -2.432614 1.030729
H  -5.551416 -1.812088 -0.313826
H  -4.077856 -2.725724 -0.629912
H  -3.583692 1.840817 -1.182039
H  0.5473 0.762424 2.225612
H  1.290615 -2.115578 2.369237
H  1.474646 -0.895889 3.624081
H  -2.10666 3.052856 -4.047751
H  -2.746516 3.570469 -2.484645
H  -1.004968 3.409042 -2.735799
H  -0.044061 1.084126 -3.203875
H  -0.959794 -0.347203 -2.731351
H  -1.305332 0.477483 -4.251117
H  1.01002 2.069418 -0.165743
H  1.031679 0.6567 -1.205803
H  2.503473 1.597585 -0.987849
H  4.59857 1.254336 0.169986
H  5.309357 -0.140837 0.946484
H  4.665552 -1.521041 -2.996115
elementType: O C H
totalener: -964.16016330 hartree
nucrepener: 1805.82093993 hartree
electener: -2769.98110323 hartree
oneelecener: -4896.53634742 hartree
twoeener: 2126.55524419 hartree
cpcmener: -0.03918658 hartree
kineticenergy: 959.77324955 hartree
xcener: -94.700019620121 hartree
chargesum: 0.0000000
charge: -0.298675 -0.491903 -0.481828 0.134470 -0.019371 -0.092249 -0.298358 -0.264227 -0.267072 0.389582 -0.016511 0.243952 -0.225222 -0.302708 -0.133469 0.009559 -0.099950 0.311296 -0.293136 -0.100331 -0.461554 0.037689 0.115536 0.093861 0.090253 0.100685 0.103173 0.096600 0.094371 0.088822 0.126763 0.106363 0.104694 0.101785 0.096390 0.089664 0.094707 0.094809 0.098067 0.119707 0.121351 0.133203 0.109740 0.135701 0.111201 0.292572
qa: -0.2987 -0.4919 -0.4818 0.1345 -0.0194 -0.0922 -0.2984 -0.2642 -0.2671 0.3896 -0.0165 0.2440 -0.2252 -0.3027 -0.1335 0.0096 -0.1000 0.3113 -0.2931 -0.1003 -0.4616 0.0377 0.1155 0.0939 0.0903 0.1007 0.1032 0.0966 0.0944 0.0888 0.1268 0.1064 0.1047 0.1018 0.0964 0.0897 0.0947 0.0948 0.0981 0.1197 0.1214 0.1332 0.1097 0.1357 0.1112 0.2926
va: 2.1224 1.9904 2.0177 3.7593 3.7927 3.8534 3.8959 3.8947 3.8368 4.0880 3.6819 3.7926 3.9251 3.9540 3.9142 3.6845 3.5350 4.0297 3.9275 3.8818 3.8253 3.5360 1.0025 1.0310 1.0180 0.9988 0.9995 1.0021 1.0024 1.0043 1.0001 1.0295 1.0276 1.0234 0.9953 1.0076 0.9960 0.9952 1.0011 0.9984 1.0095 0.9884 1.0040 0.9888 1.0199 0.9435
dispcorr: -0.023427280 hartree
energy: -964.183590577503
dipole: -21.03284 19.45472 -1.57812 6.46301 -6.09275 0.37027 -14.24500 12.83739 -1.40760
magnitude: 2.14684 au
magnitude: 5.45683 debye
