program: Orca
programVersion: 5.0.2
elementType: O O O C C C C C C C C C C C C C C C C C C C H H H H H H H H H H H H H H H H H H H H H H H H
charge: 0
multiplicity: 1
keywords: wb97x-d3
keywords: def2-TZVPP
keywords: def2/J RIJCOSX
keywords: DEFGRID2
keywords: scfconv7
keywords: smallprint printgap noloewdin
keywords: NOSOSCF
formula: C19H24O3
InChI: InChI=1/C19H24O3/c1-7-8-13-12(4)16(10-15(13)20)22-18(21)17-14(9-11(2)3)19(17,5)6/h1,9,14,16-17H,8,10H2,2-6H3
46 atoms
O  0.102867 -0.648252 0.89701
O  -1.267641 1.120163 0.831141
O  4.174669 -1.208835 2.94206
C  -3.415066 -0.995584 0.005355
C  -2.853087 -0.533669 -1.301352
C  -1.907527 -0.967708 -0.178004
C  -4.112464 -0.032631 0.933126
C  -4.017866 -2.380006 0.041306
C  -2.952639 0.855546 -1.786293
C  -1.035744 -0.033878 0.550921
C  -3.258192 1.22528 -3.036192
C  1.079225 0.052831 1.670944
C  -3.34462 2.677824 -3.39891
C  -3.539053 0.29449 -4.176709
C  1.786878 -0.916454 2.608199
C  2.167403 0.610504 0.785635
C  3.381103 0.218497 1.201245
C  3.253437 -0.702077 2.332668
C  1.84586 1.498354 -0.355096
C  4.716535 0.594554 0.635974
C  5.136486 -0.331948 -0.40839
C  5.459623 -1.105007 -1.270603
H  -2.888859 -1.284231 -2.082542
H  -1.453398 -1.938944 -0.333092
H  -4.00234 -0.352631 1.970716
H  -3.763191 0.993037 0.862345
H  -5.179862 -0.028248 0.705256
H  -3.970614 -2.799807 1.047895
H  -5.06759 -2.347116 -0.256353
H  -3.502428 -3.0659 -0.631799
H  -2.781911 1.648097 -1.068132
H  0.604586 0.865428 2.225018
H  1.525747 -1.953277 2.384856
H  1.556334 -0.741741 3.659297
H  -3.118775 3.328497 -2.554281
H  -2.650944 2.920624 -4.208103
H  -4.343218 2.931811 -3.764029
H  -2.828928 0.46257 -4.990233
H  -3.497314 -0.760223 -3.914382
H  -4.530696 0.490711 -4.591937
H  1.236292 0.972571 -1.09326
H  2.738907 1.859601 -0.860535
H  1.264697 2.359499 -0.020588
H  4.691923 1.608969 0.232975
H  5.464489 0.599306 1.433014
H  5.747433 -1.787015 -2.038801
elementType: O C H
totalener: -964.16115534 hartree
nucrepener: 1756.11492169 hartree
electener: -2720.27607703 hartree
oneelecener: -4797.17505425 hartree
twoeener: 2076.89897722 hartree
cpcmener: -0.03930354 hartree
kineticenergy: 959.76553524 hartree
xcener: -94.698465173211 hartree
chargesum: -0.0000000
charge: -0.299680 -0.496741 -0.480981 0.106508 0.034238 -0.103862 -0.288139 -0.262639 -0.303302 0.416631 -0.053881 0.254257 -0.218424 -0.253840 -0.135505 -0.024765 -0.098326 0.316234 -0.244074 -0.112223 -0.448250 0.034634 0.120402 0.096785 0.104332 0.094205 0.098517 0.094089 0.095014 0.088601 0.123312 0.105908 0.103612 0.102627 0.088482 0.093082 0.093698 0.097157 0.089039 0.096267 0.113599 0.103336 0.118252 0.131529 0.118466 0.291818
qa: -0.2997 -0.4967 -0.4810 0.1065 0.0342 -0.1039 -0.2881 -0.2626 -0.3033 0.4166 -0.0539 0.2543 -0.2184 -0.2538 -0.1355 -0.0248 -0.0983 0.3162 -0.2441 -0.1122 -0.4483 0.0346 0.1204 0.0968 0.1043 0.0942 0.0985 0.0941 0.0950 0.0886 0.1233 0.1059 0.1036 0.1026 0.0885 0.0931 0.0937 0.0972 0.0890 0.0963 0.1136 0.1033 0.1183 0.1315 0.1185 0.2918
va: 2.1288 1.9930 2.0170 3.7085 3.7293 3.8936 3.9072 3.9087 3.8466 4.0708 3.7890 3.7618 3.9208 3.9382 3.9133 3.7559 3.5287 4.0389 3.9376 3.8830 3.8221 3.5419 1.0014 1.0302 0.9985 1.0132 1.0010 1.0020 1.0015 1.0054 1.0223 1.0293 1.0286 1.0228 1.0087 0.9962 0.9964 0.9967 1.0136 0.9971 0.9998 1.0052 1.0044 0.9921 1.0115 0.9438
dispcorr: -0.021108588 hartree
energy: -964.182263923811
dipole: -26.91583 25.09734 -1.81849 4.28249 -3.98150 0.30098 -16.32714 14.90174 -1.42540
magnitude: 2.33008 au
magnitude: 5.92260 debye
