program: Orca
programVersion: 5.0.2
elementType: O O O C C C C C C C C C C C C C C C C C C C H H H H H H H H H H H H H H H H H H H H H H H H
charge: 0
multiplicity: 1
keywords: wb97x-d3
keywords: def2-TZVPP
keywords: def2/J RIJCOSX
keywords: DEFGRID2
keywords: scfconv7
keywords: smallprint printgap noloewdin
keywords: NOSOSCF
formula: C19H24O3
InChI: InChI=1/C19H24O3/c1-7-8-13-12(4)16(10-15(13)20)22-18(21)17-14(9-11(2)3)19(17,5)6/h1,9,14,16-17H,8,10H2,2-6H3
46 atoms
O  -0.096161 -0.717748 1.157343
O  -1.358905 1.131191 1.178143
O  4.10894 -1.485557 2.834148
C  -3.628461 -0.638501 0.022548
C  -2.791929 -0.358398 -1.18586
C  -2.137228 -0.875305 0.106547
C  -4.311795 0.472715 0.781445
C  -4.453217 -1.904735 -0.010727
C  -2.53968 0.99486 -1.710927
C  -1.204992 -0.026533 0.862715
C  -2.348648 1.274565 -3.005171
C  0.979058 -0.070634 1.842076
C  -2.13518 2.684685 -3.462432
C  -2.352975 0.230855 -4.090277
C  1.720255 -1.078144 2.709527
C  2.009006 0.434364 0.860221
C  3.232989 -0.031356 1.15165
C  3.16468 -0.939626 2.298828
C  1.638725 1.355958 -0.239248
C  4.519292 0.283439 0.44777
C  4.594431 -0.342454 -0.866963
C  4.636661 -0.852446 -1.954626
H  -2.829428 -1.131573 -1.945421
H  -1.830947 -1.913425 0.059975
H  -5.327525 0.589853 0.39946
H  -4.390353 0.222562 1.840729
H  -3.82591 1.440127 0.703693
H  -4.659536 -2.261871 1.000086
H  -5.41082 -1.723049 -0.501977
H  -3.948218 -2.706176 -0.551097
H  -2.527793 1.820457 -1.009522
H  0.598626 0.762008 2.437476
H  1.388189 -2.099834 2.512205
H  1.598586 -0.895824 3.777277
H  -2.156855 3.39547 -2.636651
H  -1.174698 2.787748 -3.973989
H  -2.899822 2.981641 -4.185192
H  -2.005581 0.647876 -5.035406
H  -1.711783 -0.619973 -3.8551
H  -3.356365 -0.163752 -4.26606
H  2.50709 1.704621 -0.794554
H  1.106336 2.225052 0.150225
H  0.966622 0.8653 -0.947901
H  4.632873 1.364721 0.33562
H  5.363441 -0.050409 1.055328
H  4.673338 -1.3073 -2.918997
elementType: O C H
totalener: -964.15952755 hartree
nucrepener: 1779.44299231 hartree
electener: -2743.60251986 hartree
oneelecener: -4843.80415212 hartree
twoeener: 2100.20163226 hartree
cpcmener: -0.03754272 hartree
kineticenergy: 959.76324362 hartree
xcener: -94.697565442594 hartree
chargesum: 0.0000000
charge: -0.296937 -0.491344 -0.480831 0.103163 0.061101 -0.089774 -0.286514 -0.265313 -0.354621 0.394665 -0.000146 0.246941 -0.224340 -0.289197 -0.135934 -0.013568 -0.094817 0.311955 -0.254718 -0.099761 -0.465324 0.042521 0.115212 0.096604 0.095991 0.103119 0.094075 0.094386 0.095418 0.088315 0.122369 0.106643 0.104427 0.102517 0.085895 0.095609 0.100152 0.096369 0.099887 0.107910 0.102627 0.120977 0.115556 0.135392 0.111005 0.292339
qa: -0.2969 -0.4913 -0.4808 0.1032 0.0611 -0.0898 -0.2865 -0.2653 -0.3546 0.3947 -0.0001 0.2469 -0.2243 -0.2892 -0.1359 -0.0136 -0.0948 0.3120 -0.2547 -0.0998 -0.4653 0.0425 0.1152 0.0966 0.0960 0.1031 0.0941 0.0944 0.0954 0.0883 0.1224 0.1066 0.1044 0.1025 0.0859 0.0956 0.1002 0.0964 0.0999 0.1079 0.1026 0.1210 0.1156 0.1354 0.1110 0.2923
va: 2.1248 1.9984 2.0187 3.7357 3.7126 3.8639 3.8987 3.9068 3.8964 4.0952 3.6963 3.7729 3.9212 3.9485 3.9174 3.7229 3.5388 4.0284 3.9349 3.8784 3.8260 3.5294 0.9992 1.0297 1.0008 0.9987 1.0140 1.0020 1.0018 1.0048 1.0183 1.0283 1.0280 1.0228 1.0100 0.9936 0.9928 1.0039 0.9966 0.9944 1.0045 1.0067 0.9978 0.9885 1.0203 0.9435
dispcorr: -0.021868616 hartree
energy: -964.181396170697
dipole: -23.63058 21.92062 -1.70996 5.83725 -5.48497 0.35228 -17.05160 15.64075 -1.41084
magnitude: 2.24467 au
magnitude: 5.70550 debye
