program: Orca
programVersion: 5.0.2
elementType: O O O C C C C C C C C C C C C C C C C C C C H H H H H H H H H H H H H H H H H H H H H H H H
charge: 0
multiplicity: 1
keywords: wb97x-d3
keywords: def2-TZVPP
keywords: def2/J RIJCOSX
keywords: DEFGRID2
keywords: scfconv7
keywords: smallprint printgap noloewdin
keywords: NOSOSCF
formula: C19H24O3
InChI: InChI=1/C19H24O3/c1-7-8-13-12(4)16(10-15(13)20)22-18(21)17-14(9-11(2)3)19(17,5)6/h1,9,14,16-17H,8,10H2,2-6H3
46 atoms
O  -0.686975 0.141254 0.882087
O  -1.582045 -1.225857 2.394203
O  3.252563 -1.924315 -0.091971
C  -3.499886 0.781824 -0.070829
C  -2.981992 -0.345089 -0.895091
C  -2.953516 -0.44718 0.636889
C  -2.791866 2.113505 -0.022483
C  -5.001203 0.927001 0.02657
C  -1.744955 -0.240467 -1.708713
C  -1.698442 -0.544287 1.396269
C  -1.012178 -1.276518 -2.124021
C  0.617262 -0.040078 1.437408
C  0.221707 -1.074276 -2.948079
C  -1.332334 -2.699662 -1.78762
C  1.223636 -1.407987 1.138087
C  1.502647 0.947246 0.724309
C  2.526973 0.342339 0.107341
C  2.455489 -1.10462 0.319585
C  1.197855 2.397741 0.745735
C  3.617436 0.993863 -0.689116
C  4.570532 1.702373 0.156869
C  5.340158 2.2930 0.866562
H  -3.745931 -0.991909 -1.317827
H  -3.711726 -1.092653 1.064369
H  -2.922626 2.582403 0.954217
H  -1.726721 2.065735 -0.227099
H  -3.232802 2.780733 -0.765368
H  -5.507063 -0.038651 -0.004524
H  -5.286488 1.424627 0.955285
H  -5.379693 1.52789 -0.802515
H  -1.425585 0.757545 -1.993266
H  0.597503 0.177812 2.508692
H  0.554806 -2.052232 0.562236
H  1.497325 -1.952476 2.042301
H  0.156623 -1.609334 -3.89917
H  0.404507 -0.021877 -3.164325
H  1.100718 -1.47173 -2.432552
H  -0.460883 -3.197748 -1.355168
H  -2.157174 -2.799909 -1.084361
H  -1.590545 -3.263519 -2.687978
H  2.091392 3.004298 0.607019
H  0.722354 2.688724 1.682208
H  0.503689 2.650407 -0.059497
H  4.146743 0.240543 -1.276651
H  3.188001 1.69581 -1.40823
H  6.026977 2.817429 1.492323
elementType: O C H
totalener: -964.15689999 hartree
nucrepener: 1874.60028501 hartree
electener: -2838.75718500 hartree
oneelecener: -5033.54144220 hartree
twoeener: 2194.78425720 hartree
cpcmener: -0.04107149 hartree
kineticenergy: 959.78686482 hartree
xcener: -94.702546530704 hartree
chargesum: 0.0000000
charge: -0.262958 -0.503448 -0.483665 0.141102 -0.019654 -0.139301 -0.271288 -0.271526 -0.242213 0.418786 -0.039786 0.227607 -0.240113 -0.272863 -0.141751 -0.021341 -0.099697 0.308805 -0.293596 -0.112695 -0.471246 0.066731 0.114802 0.093789 0.106155 0.060558 0.101208 0.088369 0.096804 0.094872 0.125885 0.117210 0.113030 0.118356 0.108142 0.093137 0.086944 0.093452 0.094787 0.113698 0.111555 0.118833 0.132734 0.111490 0.136741 0.291561
qa: -0.2630 -0.5034 -0.4837 0.1411 -0.0197 -0.1393 -0.2713 -0.2715 -0.2422 0.4188 -0.0398 0.2276 -0.2401 -0.2729 -0.1418 -0.0213 -0.0997 0.3088 -0.2936 -0.1127 -0.4712 0.0667 0.1148 0.0938 0.1062 0.0606 0.1012 0.0884 0.0968 0.0949 0.1259 0.1172 0.1130 0.1184 0.1081 0.0931 0.0869 0.0935 0.0948 0.1137 0.1116 0.1188 0.1327 0.1115 0.1367 0.2916
va: 2.1094 1.9962 2.0069 3.7480 3.7867 3.8794 3.9028 3.9050 3.8221 4.1025 3.7000 3.7580 3.9219 3.9412 3.8869 3.7302 3.4994 3.9920 3.9568 3.8815 3.8499 3.5003 1.0033 1.0275 1.0004 1.0124 1.0012 1.0049 1.0014 1.0019 0.9994 1.0135 1.0169 1.0204 0.9984 1.0055 1.0002 0.9972 1.0045 0.9986 1.0010 1.0009 0.9856 1.0190 0.9896 0.9438
dispcorr: -0.026798976 hartree
energy: -964.183698963022
dipole: -15.33400 13.81707 -1.51693 5.68473 -3.52242 2.16231 -10.50298 9.70581 -0.79717
magnitude: 2.75901 au
magnitude: 7.01286 debye
