program: Orca
programVersion: 5.0.2
elementType: O O O C C C C C C C C C C C C C C C C C C C H H H H H H H H H H H H H H H H H H H H H H H H
charge: 0
multiplicity: 1
keywords: wb97x-d3
keywords: def2-TZVPP
keywords: def2/J RIJCOSX
keywords: DEFGRID2
keywords: scfconv7
keywords: smallprint printgap noloewdin
keywords: NOSOSCF
formula: C19H24O3
InChI: InChI=1/C19H24O3/c1-7-8-13-12(4)16(10-15(13)20)22-18(21)17-14(9-11(2)3)19(17,5)6/h1,9,14,16-17H,8,10H2,2-6H3
46 atoms
O  0.170169 -0.650991 0.849975
O  -1.273285 1.059124 0.843394
O  4.19828 -1.104431 3.025252
C  -3.328362 -1.108098 -0.065482
C  -2.791082 -0.570879 -1.354102
C  -1.823635 -1.008637 -0.252725
C  -4.063597 -0.202619 0.89021
C  -3.876088 -2.515007 -0.077371
C  -2.95943 0.835316 -1.771767
C  -0.991734 -0.071762 0.518784
C  -3.451981 1.245655 -2.946398
C  1.114408 0.068618 1.647298
C  -3.583117 2.709631 -3.244205
C  -3.921484 0.348647 -4.05067
C  1.815105 -0.876628 2.613717
C  2.214098 0.634446 0.783225
C  3.424254 0.271034 1.233339
C  3.284655 -0.631727 2.378165
C  1.902402 1.497601 -0.378685
C  4.763995 0.660815 0.687439
C  5.188209 -0.239989 -0.377726
C  5.50885 -0.995207 -1.256337
H  -2.799594 -1.286767 -2.168645
H  -1.330706 -1.953564 -0.447283
H  -5.131049 -0.241514 0.665624
H  -3.934465 -0.540599 1.9198
H  -3.762606 0.839492 0.83984
H  -4.926117 -2.512498 -0.375907
H  -3.334244 -3.157986 -0.771701
H  -3.814055 -2.966193 0.914801
H  -2.673908 1.603466 -1.064005
H  0.613826 0.879377 2.180257
H  1.584888 -1.921053 2.392056
H  1.549571 -0.697716 3.655784
H  -3.214161 3.330834 -2.428253
H  -3.032046 2.977957 -4.149252
H  -4.626387 2.979119 -3.428622
H  -3.335499 0.515226 -4.958331
H  -3.87363 -0.712115 -3.813346
H  -4.957533 0.580643 -4.31043
H  1.264654 2.331219 -0.079545
H  1.353221 0.935459 -1.137397
H  2.798825 1.89825 -0.84726
H  4.741141 1.684083 0.306844
H  5.50716 0.648006 1.488592
H  5.796631 -1.653508 -2.04492
elementType: O C H
totalener: -964.16092156 hartree
nucrepener: 1753.94570915 hartree
electener: -2718.10663071 hartree
oneelecener: -4792.80740680 hartree
twoeener: 2074.70077608 hartree
cpcmener: -0.03884940 hartree
kineticenergy: 959.76424410 hartree
xcener: -94.698135066000 hartree
chargesum: -0.0000000
charge: -0.301433 -0.496986 -0.481042 0.117835 0.034065 -0.120288 -0.290351 -0.263046 -0.313099 0.423108 -0.039514 0.254317 -0.222825 -0.254318 -0.135486 -0.026204 -0.098517 0.316813 -0.242976 -0.109275 -0.446702 0.031681 0.116493 0.097741 0.098420 0.105345 0.095201 0.094475 0.089081 0.094073 0.126392 0.105431 0.103614 0.102555 0.089270 0.093139 0.094045 0.097652 0.089464 0.095044 0.117535 0.114755 0.103721 0.132304 0.116595 0.291897
qa: -0.3014 -0.4970 -0.4810 0.1178 0.0341 -0.1203 -0.2904 -0.2630 -0.3131 0.4231 -0.0395 0.2543 -0.2228 -0.2543 -0.1355 -0.0262 -0.0985 0.3168 -0.2430 -0.1093 -0.4467 0.0317 0.1165 0.0977 0.0984 0.1053 0.0952 0.0945 0.0891 0.0941 0.1264 0.1054 0.1036 0.1026 0.0893 0.0931 0.0940 0.0977 0.0895 0.0950 0.1175 0.1148 0.1037 0.1323 0.1166 0.2919
va: 2.1297 1.9921 2.0171 3.7055 3.7347 3.9326 3.9089 3.9087 3.8496 4.0620 3.7659 3.7621 3.9232 3.9400 3.9113 3.7571 3.5284 4.0360 3.9365 3.8833 3.8234 3.5436 1.0042 1.0298 1.0015 0.9989 1.0126 1.0015 1.0052 1.0020 1.0217 1.0314 1.0283 1.0230 1.0084 0.9960 0.9963 0.9967 1.0117 0.9974 1.0053 0.9997 1.0046 0.9913 1.0134 0.9439
dispcorr: -0.021136974 hartree
energy: -964.182058534985
dipole: -27.72703 25.91704 -1.80998 3.85023 -3.59212 0.25811 -16.30105 14.78314 -1.51790
magnitude: 2.37628 au
magnitude: 6.04001 debye
