program: Orca
programVersion: 5.0.2
elementType: O O O C C C C C C C C C C C C C C C C C C C H H H H H H H H H H H H H H H H H H H H H H H H
charge: 0
multiplicity: 1
keywords: wb97x-d3
keywords: def2-TZVPP
keywords: def2/J RIJCOSX
keywords: DEFGRID2
keywords: scfconv7
keywords: smallprint printgap noloewdin
keywords: NOSOSCF
formula: C19H24O3
InChI: InChI=1/C19H24O3/c1-7-8-13-12(4)16(10-15(13)20)22-18(21)17-14(9-11(2)3)19(17,5)6/h1,9,14,16-17H,8,10H2,2-6H3
46 atoms
O  -0.45174 -0.394989 0.473814
O  -1.596562 -0.741213 2.362788
O  3.927986 -1.212253 -0.627721
C  -2.836236 1.2293 -0.486133
C  -3.009409 -0.151506 -1.015285
C  -2.764532 0.054993 0.480143
C  -1.616674 2.049151 -0.830735
C  -4.080885 2.07432 -0.34146
C  -2.02843 -0.795062 -1.925545
C  -1.5628 -0.394717 1.200332
C  -1.794063 -2.107454 -1.990334
C  0.792365 -0.805873 1.043963
C  -0.806938 -2.676415 -2.962358
C  -2.452232 -3.104673 -1.088722
C  1.612238 -1.567384 0.011102
C  1.623536 0.403166 1.390073
C  2.833067 0.350522 0.812656
C  2.9409 -0.852484 -0.016858
C  1.094361 1.463148 2.278889
C  3.946421 1.346147 0.945723
C  3.598526 2.635477 0.360493
C  3.283824 3.696508 -0.108622
H  -4.04162 -0.437665 -1.202974
H  -3.644276 -0.063612 1.101612
H  -1.35679 2.716811 -0.006795
H  -0.735732 1.463123 -1.076359
H  -1.839811 2.675375 -1.696672
H  -4.952543 1.47246 -0.082485
H  -3.95435 2.831138 0.434984
H  -4.300443 2.592165 -1.277063
H  -1.489124 -0.140914 -2.604904
H  0.616979 -1.405904 1.938948
H  1.156946 -1.513063 -0.981083
H  1.738124 -2.622444 0.254607
H  -0.021331 -3.228601 -2.439619
H  -1.285179 -3.389148 -3.639076
H  -0.331588 -1.903227 -3.565511
H  -1.706606 -3.603584 -0.463317
H  -3.197884 -2.662626 -0.430505
H  -2.940612 -3.891056 -1.669476
H  0.334072 2.051632 1.757643
H  1.871014 2.14855 2.612276
H  0.612373 1.030017 3.156279
H  4.201657 1.488026 1.999443
H  4.847185 0.96026 0.463342
H  3.013012 4.63714 -0.533037
elementType: O C H
totalener: -964.15688822 hartree
nucrepener: 1858.44940749 hartree
electener: -2822.60629571 hartree
oneelecener: -5001.36532804 hartree
twoeener: 2178.75903233 hartree
cpcmener: -0.03908720 hartree
kineticenergy: 959.77621993 hartree
xcener: -94.701390651599 hartree
chargesum: -0.0000000
charge: -0.261603 -0.504984 -0.480796 0.146416 -0.016023 -0.153556 -0.315543 -0.268889 -0.253268 0.435249 -0.045845 0.201621 -0.240201 -0.266044 -0.126459 -0.003478 -0.095931 0.314042 -0.260744 -0.092422 -0.462120 0.034998 0.115239 0.095245 0.105299 0.091180 0.105815 0.088365 0.095891 0.094117 0.125630 0.111844 0.097282 0.108947 0.090514 0.109792 0.095646 0.098549 0.094665 0.107642 0.123492 0.105684 0.118879 0.135331 0.108727 0.291807
qa: -0.2616 -0.5050 -0.4808 0.1464 -0.0160 -0.1536 -0.3155 -0.2689 -0.2533 0.4352 -0.0458 0.2016 -0.2402 -0.2660 -0.1265 -0.0035 -0.0959 0.3140 -0.2607 -0.0924 -0.4621 0.0350 0.1152 0.0952 0.1053 0.0912 0.1058 0.0884 0.0959 0.0941 0.1256 0.1118 0.0973 0.1089 0.0905 0.1098 0.0956 0.0985 0.0947 0.1076 0.1235 0.1057 0.1189 0.1353 0.1087 0.2918
va: 2.0987 1.9893 2.0217 3.7057 3.8030 3.8711 3.9027 3.9043 3.8296 4.0863 3.7003 3.7771 3.9137 3.9448 3.9025 3.6895 3.5259 4.0451 3.9357 3.8877 3.8186 3.5368 1.0048 1.0275 0.9979 1.0093 1.0017 1.0054 1.0016 1.0022 0.9996 1.0328 1.0336 1.0207 0.9949 0.9980 1.0048 0.9971 1.0046 0.9996 0.9915 1.0008 1.0112 0.9886 1.0218 0.9440
dispcorr: -0.025681809 hartree
energy: -964.182570026982
dipole: -16.13663 14.66447 -1.47217 1.25794 -0.53759 0.72035 -7.45486 7.52442 0.06956
magnitude: 1.64043 au
magnitude: 4.16965 debye
