program: Orca
programVersion: 5.0.2
elementType: O O O C C C C C C C C C C C C C C C C C C C H H H H H H H H H H H H H H H H H H H H H H H H
charge: 0
multiplicity: 1
keywords: wb97x-d3
keywords: def2-TZVPP
keywords: def2/J RIJCOSX
keywords: DEFGRID2
keywords: scfconv7
keywords: smallprint printgap noloewdin
keywords: NOSOSCF
formula: C19H24O3
InChI: InChI=1/C19H24O3/c1-7-8-13-12(4)16(10-15(13)20)22-18(21)17-14(9-11(2)3)19(17,5)6/h1,9,14,16-17H,8,10H2,2-6H3
46 atoms
O  -0.193818 -0.726545 1.073232
O  -1.422177 1.146279 1.066259
O  4.072038 -1.444226 2.650227
C  -3.770682 -0.618948 0.086763
C  -2.989919 -0.326523 -1.148977
C  -2.278211 -0.875908 0.102002
C  -4.402184 0.480365 0.904972
C  -4.611535 -1.874962 0.069489
C  -2.746062 1.042921 -1.651408
C  -1.301529 -0.026217 0.793637
C  -2.053494 1.342906 -2.755658
C  0.909787 -0.073291 1.704081
C  -1.917761 2.761613 -3.218347
C  -1.364533 0.332855 -3.620739
C  1.676516 -1.067437 2.564819
C  1.910162 0.412313 0.682131
C  3.145776 -0.03089 0.960085
C  3.111249 -0.916674 2.125929
C  1.507499 1.295581 -0.4371
C  4.413956 0.280753 0.223112
C  4.532235 -0.485667 -1.011514
C  4.599889 -1.121144 -2.029788
H  -3.063194 -1.085065 -1.921153
H  -1.983956 -1.916312 0.033469
H  -4.492567 0.171085 1.947599
H  -3.866663 1.424169 0.888079
H  -5.410798 0.669014 0.533081
H  -4.148893 -2.668264 -0.51866
H  -4.765644 -2.255023 1.081093
H  -5.592769 -1.669522 -0.362231
H  -3.191709 1.863448 -1.099904
H  0.55548 0.772103 2.29798
H  1.352201 -2.09329 2.375849
H  1.571597 -0.882773 3.63386
H  -2.427678 3.461275 -2.556568
H  -0.866488 3.054622 -3.277242
H  -2.32844 2.886634 -4.223676
H  -1.373981 -0.674799 -3.210268
H  -1.824042 0.295769 -4.611911
H  -0.32128 0.616214 -3.778432
H  2.360648 1.627418 -1.025365
H  0.980722 2.175534 -0.065133
H  0.821174 0.777335 -1.1124
H  4.4621 1.346363 -0.013143
H  5.273816 0.070181 0.863038
H  4.675767 -1.684108 -2.932693
elementType: O C H
totalener: -964.16074102 hartree
nucrepener: 1797.63229157 hartree
electener: -2761.79303259 hartree
oneelecener: -4880.19525839 hartree
twoeener: 2118.40222580 hartree
cpcmener: -0.03890174 hartree
kineticenergy: 959.76639349 hartree
xcener: -94.698414798804 hartree
chargesum: -0.0000000
charge: -0.297636 -0.492388 -0.480797 0.126186 -0.028532 -0.063576 -0.293106 -0.262073 -0.254017 0.381137 -0.050913 0.243832 -0.229182 -0.268692 -0.132373 -0.002282 -0.098154 0.312322 -0.266157 -0.105997 -0.454618 0.035475 0.112305 0.094168 0.102629 0.091741 0.099580 0.088884 0.095913 0.095647 0.125285 0.107909 0.104384 0.101761 0.089340 0.093381 0.098400 0.091947 0.111336 0.094307 0.105510 0.121385 0.115387 0.135049 0.112972 0.292323
qa: -0.2976 -0.4924 -0.4808 0.1262 -0.0285 -0.0636 -0.2931 -0.2621 -0.2540 0.3811 -0.0509 0.2438 -0.2292 -0.2687 -0.1324 -0.0023 -0.0982 0.3123 -0.2662 -0.1060 -0.4546 0.0355 0.1123 0.0942 0.1026 0.0917 0.0996 0.0889 0.0959 0.0956 0.1253 0.1079 0.1044 0.1018 0.0893 0.0934 0.0984 0.0919 0.1113 0.0943 0.1055 0.1214 0.1154 0.1350 0.1130 0.2923
va: 2.1246 1.9903 2.0181 3.7792 3.7703 3.8584 3.8897 3.8935 3.8436 4.0916 3.7376 3.7828 3.9264 3.9407 3.9123 3.7092 3.5383 4.0352 3.9379 3.8841 3.8249 3.5373 1.0025 1.0306 0.9989 1.0207 0.9994 1.0044 1.0025 1.0021 1.0051 1.0279 1.0279 1.0234 1.0082 0.9965 0.9953 1.0068 0.9975 0.9969 1.0054 1.0065 0.9927 0.9891 1.0175 0.9437
dispcorr: -0.022781955 hartree
energy: -964.183522978049
dipole: -21.80380 20.13588 -1.66791 6.15433 -5.78659 0.36774 -15.29108 13.91862 -1.37246
magnitude: 2.19107 au
magnitude: 5.56926 debye
