program: Orca
programVersion: 5.0.2
elementType: O O O C C C C C C C C C C C C C C C C C C C H H H H H H H H H H H H H H H H H H H H H H H H
charge: 0
multiplicity: 1
keywords: wb97x-d3
keywords: def2-TZVPP
keywords: def2/J RIJCOSX
keywords: DEFGRID2
keywords: scfconv7
keywords: smallprint printgap noloewdin
keywords: NOSOSCF
formula: C19H24O3
InChI: InChI=1/C19H24O3/c1-7-8-13-12(4)16(10-15(13)20)22-18(21)17-14(9-11(2)3)19(17,5)6/h1,9,14,16-17H,8,10H2,2-6H3
46 atoms
O  0.198605 -0.621977 0.836136
O  -1.273573 1.065153 0.863947
O  4.179335 -1.114654 3.098574
C  -3.272367 -1.132753 -0.123706
C  -2.742967 -0.537659 -1.389751
C  -1.770625 -0.981058 -0.299176
C  -4.038075 -0.278621 0.854808
C  -3.77521 -2.554667 -0.187514
C  -2.952723 0.873916 -1.776836
C  -0.967415 -0.050006 0.508862
C  -3.564558 1.268116 -2.899418
C  1.135806 0.080462 1.654615
C  -3.714523 2.723593 -3.224427
C  -4.141017 0.339907 -3.926015
C  1.808537 -0.878269 2.627338
C  2.256881 0.632237 0.809856
C  3.455167 0.257084 1.281729
C  3.284303 -0.638827 2.428141
C  1.972102 1.489301 -0.363245
C  4.807417 0.633671 0.756289
C  5.200205 -0.200553 -0.373287
C  5.507828 -0.891082 -1.307884
H  -2.722157 -1.228947 -2.22516
H  -1.248942 -1.904024 -0.521431
H  -5.104527 -0.355096 0.634716
H  -3.890683 -0.63139 1.877098
H  -3.779205 0.77594 0.823064
H  -3.690494 -3.04431 0.784548
H  -4.826871 -2.574523 -0.47962
H  -3.217844 -3.149953 -0.911475
H  -2.590012 1.64435 -1.107504
H  0.638721 0.897365 2.18188
H  1.581573 -1.918131 2.38097
H  1.517236 -0.716546 3.665118
H  -3.244024 3.365684 -2.480219
H  -3.272187 2.953616 -4.197401
H  -4.769281 3.001977 -3.294383
H  -3.529694 0.332884 -4.832659
H  -4.238379 -0.688117 -3.583071
H  -5.133992 0.679214 -4.228745
H  1.286367 2.295575 -0.097658
H  1.485275 0.906593 -1.149058
H  2.874792 1.925831 -0.785783
H  4.82067 1.682683 0.451793
H  5.551636 0.535433 1.550376
H  5.769709 -1.497394 -2.145707
elementType: O C H
totalener: -964.16026073 hartree
nucrepener: 1752.37202766 hartree
electener: -2716.53228839 hartree
oneelecener: -4789.62094625 hartree
twoeener: 2073.08865786 hartree
cpcmener: -0.03848365 hartree
kineticenergy: 959.76524968 hartree
xcener: -94.697952709807 hartree
chargesum: 0.0000000
charge: -0.300000 -0.497934 -0.481525 0.140166 0.027508 -0.138552 -0.289553 -0.267420 -0.327659 0.426426 -0.011755 0.252752 -0.227224 -0.267047 -0.136794 -0.024019 -0.099271 0.317687 -0.243752 -0.110377 -0.452180 0.038306 0.116181 0.097451 0.098094 0.105802 0.094513 0.094919 0.093757 0.089111 0.127025 0.105163 0.103763 0.102374 0.089204 0.094115 0.094391 0.102256 0.092214 0.093639 0.116649 0.115993 0.105691 0.133922 0.114211 0.291780
qa: -0.3000 -0.4979 -0.4815 0.1402 0.0275 -0.1386 -0.2896 -0.2674 -0.3277 0.4264 -0.0118 0.2528 -0.2272 -0.2670 -0.1368 -0.0240 -0.0993 0.3177 -0.2438 -0.1104 -0.4522 0.0383 0.1162 0.0975 0.0981 0.1058 0.0945 0.0949 0.0938 0.0891 0.1270 0.1052 0.1038 0.1024 0.0892 0.0941 0.0944 0.1023 0.0922 0.0936 0.1166 0.1160 0.1057 0.1339 0.1142 0.2918
va: 2.1295 1.9911 2.0169 3.6916 3.7367 3.9690 3.9094 3.9101 3.8753 4.0585 3.7272 3.7658 3.9285 3.9463 3.9141 3.7501 3.5295 4.0298 3.9340 3.8808 3.8284 3.5378 1.0024 1.0304 1.0016 0.9991 1.0127 1.0020 1.0020 1.0048 1.0228 1.0317 1.0281 1.0232 1.0084 0.9946 0.9965 0.9954 1.0066 0.9983 1.0069 0.9995 1.0033 0.9902 1.0160 0.9439
dispcorr: -0.021238553 hartree
energy: -964.181499282967
dipole: -27.96429 26.22167 -1.74262 3.49369 -3.26298 0.23071 -16.48751 14.89518 -1.59232
magnitude: 2.37180 au
magnitude: 6.02864 debye
