program: Orca
programVersion: 5.0.2
elementType: O O O C C C C C C C C C C C C C C C C C C C H H H H H H H H H H H H H H H H H H H H H H H H
charge: 0
multiplicity: 1
keywords: wb97x-d3
keywords: def2-TZVPP
keywords: def2/J RIJCOSX
keywords: DEFGRID2
keywords: scfconv7
keywords: smallprint printgap noloewdin
keywords: NOSOSCF
formula: C19H24O3
InChI: InChI=1/C19H24O3/c1-7-8-13-12(4)16(10-15(13)20)22-18(21)17-14(9-11(2)3)19(17,5)6/h1,9,14,16-17H,8,10H2,2-6H3
46 atoms
O  -0.396765 -0.247513 1.659292
O  -0.112044 -0.140722 -0.554005
O  4.097731 -1.366273 0.578973
C  -3.11519 0.832707 -0.420385
C  -3.158317 -0.609518 -0.8108
C  -2.32249 -0.177845 0.395265
C  -2.41704 1.858403 -1.277663
C  -4.331657 1.391248 0.277798
C  -2.578254 -1.127024 -2.064476
C  -0.852659 -0.188768 0.40089
C  -2.981538 -2.221168 -2.721898
C  1.00634 -0.183848 1.903477
C  -2.326752 -2.614115 -4.012782
C  -4.073344 -3.147932 -2.282032
C  1.831915 -1.385047 1.454058
C  1.69285 1.016249 1.301438
C  2.886199 0.68093 0.78762
C  3.087763 -0.764304 0.89154
C  1.093827 2.367213 1.40891
C  3.924062 1.596181 0.210537
C  4.778169 2.165607 1.246542
C  5.460799 2.645508 2.112099
H  -4.057325 -1.12209 -0.487913
H  -2.758174 -0.418965 1.357555
H  -3.116666 2.248699 -2.01898
H  -2.087074 2.70069 -0.666411
H  -1.550968 1.483734 -1.815505
H  -5.056596 1.75394 -0.453448
H  -4.82752 0.641364 0.89506
H  -4.06104 2.230123 0.921734
H  -1.774175 -0.555997 -2.511943
H  1.059482 -0.083257 2.989957
H  1.339543 -1.970554 0.675448
H  2.066486 -2.067518 2.270827
H  -1.910499 -3.622836 -3.94917
H  -3.052126 -2.632083 -4.830452
H  -1.521933 -1.934357 -4.291901
H  -3.678661 -4.155442 -2.128294
H  -4.570568 -2.846472 -1.36288
H  -4.836453 -3.233861 -3.059608
H  0.713046 2.538749 2.417006
H  0.244222 2.473727 0.729594
H  1.806781 3.15369 1.170811
H  4.541055 1.05206 -0.508256
H  3.449713 2.406799 -0.346544
H  6.063396 3.063223 2.886888
elementType: O C H
totalener: -964.15869728 hartree
nucrepener: 1789.23085980 hartree
electener: -2753.38955708 hartree
oneelecener: -4863.78580745 hartree
twoeener: 2110.39625037 hartree
cpcmener: -0.04236587 hartree
kineticenergy: 959.76499766 hartree
xcener: -94.701145403817 hartree
chargesum: 0.0000000
charge: -0.303856 -0.492021 -0.488217 0.110992 0.023838 -0.085012 -0.302135 -0.260958 -0.294090 0.395294 -0.052741 0.287181 -0.220847 -0.256390 -0.155347 0.013986 -0.149823 0.317513 -0.252007 -0.129208 -0.449809 0.039203 0.120693 0.095958 0.107555 0.098227 0.100036 0.095105 0.088817 0.094091 0.117160 0.122986 0.116052 0.106745 0.093038 0.093977 0.088832 0.097601 0.090737 0.095900 0.117373 0.118302 0.103246 0.117583 0.132236 0.292206
qa: -0.3039 -0.4920 -0.4882 0.1110 0.0238 -0.0850 -0.3021 -0.2610 -0.2941 0.3953 -0.0527 0.2872 -0.2208 -0.2564 -0.1553 0.0140 -0.1498 0.3175 -0.2520 -0.1292 -0.4498 0.0392 0.1207 0.0960 0.1076 0.0982 0.1000 0.0951 0.0888 0.0941 0.1172 0.1230 0.1161 0.1067 0.0930 0.0940 0.0888 0.0976 0.0907 0.0959 0.1174 0.1183 0.1032 0.1176 0.1322 0.2922
va: 2.1298 2.0016 2.0091 3.7160 3.7417 3.8308 3.9018 3.9017 3.8534 4.0961 3.7831 3.7723 3.9214 3.9385 3.8899 3.6478 3.5356 4.0426 3.9517 3.8944 3.8189 3.5352 1.0002 1.0318 1.0014 1.0008 1.0143 1.0015 1.0056 1.0026 1.0212 0.9928 1.0255 1.0247 0.9964 0.9961 1.0086 0.9968 1.0127 0.9965 0.9996 0.9958 1.0015 1.0121 0.9911 0.9435
dispcorr: -0.022257497 hartree
energy: -964.180954780564
dipole: -25.88214 22.88326 -2.99888 1.10841 0.09532 1.20374 -11.36659 12.38288 1.01630
magnitude: 3.38749 au
magnitude: 8.61032 debye
