program: Orca
programVersion: 5.0.2
elementType: O O O C C C C C C C C C C C C C C C C C C C H H H H H H H H H H H H H H H H H H H H H H H H
charge: 0
multiplicity: 1
keywords: wb97x-d3
keywords: def2-TZVPP
keywords: def2/J RIJCOSX
keywords: DEFGRID2
keywords: scfconv7
keywords: smallprint printgap noloewdin
keywords: NOSOSCF
formula: C19H24O3
InChI: InChI=1/C19H24O3/c1-7-8-13-12(4)16(10-15(13)20)22-18(21)17-14(9-11(2)3)19(17,5)6/h1,9,14,16-17H,8,10H2,2-6H3
46 atoms
O  0.287463 -0.545523 0.646444
O  -1.394074 0.891315 1.00122
O  4.162443 -1.002743 3.101545
C  -3.12242 -1.397146 -0.260317
C  -2.778002 -0.518419 -1.421605
C  -1.674569 -0.988431 -0.47282
C  -3.929958 -0.854521 0.892046
C  -3.416414 -2.848523 -0.554562
C  -3.213936 0.88912 -1.523794
C  -0.960684 -0.097211 0.455681
C  -3.857474 1.429232 -2.565185
C  1.176317 0.156097 1.51809
C  -4.249243 2.876961 -2.548564
C  -4.250271 0.698027 -3.812845
C  1.811728 -0.786003 2.531471
C  2.326672 0.70074 0.712475
C  3.50764 0.326608 1.226241
C  3.294647 -0.546906 2.38328
C  2.075587 1.548056 -0.475393
C  4.875804 0.682257 0.728654
C  5.278326 -0.180983 -0.375521
C  5.588922 -0.89718 -1.289697
H  -2.721323 -1.04127 -2.370021
H  -1.043719 -1.768815 -0.880953
H  -3.817881 0.214099 1.050788
H  -4.988648 -1.043486 0.705335
H  -3.667497 -1.362249 1.82175
H  -2.821073 -3.223573 -1.387727
H  -3.204792 -3.473284 0.315382
H  -4.469261 -2.981234 -0.810899
H  -3.006739 1.538783 -0.68277
H  0.652751 0.977683 2.010176
H  1.595129 -1.830358 2.295443
H  1.482528 -0.605572 3.554732
H  -3.917103 3.383645 -1.642749
H  -3.828248 3.408216 -3.406273
H  -5.334193 2.989048 -2.620282
H  -3.697906 1.07973 -4.675637
H  -4.091282 -0.377335 -3.765075
H  -5.308112 0.863984 -4.03002
H  1.692427 0.94175 -1.29953
H  2.976402 2.049627 -0.824009
H  1.316471 2.301958 -0.260015
H  4.906436 1.724031 0.40189
H  5.601566 0.593061 1.540374
H  5.849584 -1.542611 -2.098092
elementType: O C H
totalener: -964.16035871 hartree
nucrepener: 1748.31437746 hartree
electener: -2712.47473617 hartree
oneelecener: -4781.47871525 hartree
twoeener: 2069.00397909 hartree
cpcmener: -0.03885081 hartree
kineticenergy: 959.76421445 hartree
xcener: -94.697735637708 hartree
chargesum: -0.0000000
charge: -0.302607 -0.496455 -0.481046 0.121761 0.032845 -0.130112 -0.288541 -0.264024 -0.317019 0.432271 -0.029433 0.250442 -0.224768 -0.259697 -0.138978 -0.016497 -0.101225 0.321879 -0.253493 -0.108676 -0.449313 0.034119 0.115019 0.098558 0.094715 0.098574 0.105082 0.089435 0.093890 0.094772 0.125156 0.106348 0.102671 0.102505 0.089234 0.093205 0.094200 0.100066 0.090585 0.094039 0.114582 0.108445 0.117574 0.133958 0.114064 0.291889
qa: -0.3026 -0.4965 -0.4810 0.1218 0.0328 -0.1301 -0.2885 -0.2640 -0.3170 0.4323 -0.0294 0.2504 -0.2248 -0.2597 -0.1390 -0.0165 -0.1012 0.3219 -0.2535 -0.1087 -0.4493 0.0341 0.1150 0.0986 0.0947 0.0986 0.1051 0.0894 0.0939 0.0948 0.1252 0.1063 0.1027 0.1025 0.0892 0.0932 0.0942 0.1001 0.0906 0.0940 0.1146 0.1084 0.1176 0.1340 0.1141 0.2919
va: 2.1257 1.9995 2.0176 3.7033 3.7337 3.9209 3.9111 3.9105 3.8616 4.0667 3.7497 3.7589 3.9250 3.9419 3.9131 3.7302 3.5367 4.0280 3.9339 3.8790 3.8250 3.5414 1.0050 1.0307 1.0122 1.0014 0.9989 1.0048 1.0021 1.0016 1.0233 1.0360 1.0275 1.0237 1.0084 0.9954 0.9965 0.9959 1.0102 0.9975 1.0010 1.0020 1.0046 0.9907 1.0163 0.9437
dispcorr: -0.020944517 hartree
energy: -964.181303223674
dipole: -27.99794 26.42484 -1.57310 3.03524 -2.72929 0.30594 -15.97137 14.12699 -1.84437
magnitude: 2.44335 au
magnitude: 6.21050 debye
