program: Orca
programVersion: 5.0.2
elementType: O O O C C C C C C C C C C C C C C C C C C C H H H H H H H H H H H H H H H H H H H H H H H H
charge: 0
multiplicity: 1
keywords: wb97x-d3
keywords: def2-TZVPP
keywords: def2/J RIJCOSX
keywords: DEFGRID2
keywords: scfconv7
keywords: smallprint printgap noloewdin
keywords: NOSOSCF
formula: C19H24O3
InChI: InChI=1/C19H24O3/c1-7-8-13-12(4)16(10-15(13)20)22-18(21)17-14(9-11(2)3)19(17,5)6/h1,9,14,16-17H,8,10H2,2-6H3
46 atoms
O  -0.378296 -0.811603 1.073765
O  -1.494677 1.063808 1.563867
O  3.66798 -2.503928 1.539313
C  -3.863826 -0.060768 -0.05724
C  -2.838111 -0.136551 -1.141205
C  -2.526809 -0.67744 0.259879
C  -4.303468 1.270533 0.5036
C  -5.001622 -1.052992 -0.136604
C  -2.125997 1.053555 -1.67071
C  -1.456305 -0.02255 1.035698
C  -0.958473 0.995032 -2.319519
C  0.763182 -0.430975 1.857828
C  -0.316867 2.220717 -2.892923
C  -0.203014 -0.278721 -2.537513
C  1.500196 -1.696136 2.273188
C  1.754023 0.335284 1.009489
C  2.882388 -0.364646 0.817441
C  2.808809 -1.645226 1.526665
C  1.454622 1.695381 0.505078
C  4.090644 0.044758 0.027653
C  3.781709 0.322042 -1.369448
C  3.495547 0.560785 -2.512053
H  -2.985574 -0.93418 -1.863534
H  -2.501786 -1.759748 0.324427
H  -5.172838 1.620942 -0.05579
H  -4.607586 1.169302 1.54653
H  -3.550056 2.051145 0.452867
H  -5.797814 -0.672896 -0.779247
H  -4.678972 -2.013672 -0.53991
H  -5.429714 -1.233701 0.851222
H  -2.602597 2.021673 -1.550309
H  0.442583 0.162301 2.715906
H  0.948432 -2.608124 2.042977
H  1.702654 -1.705116 3.345814
H  -0.240779 2.14656 -3.981041
H  -0.873211 3.127137 -2.655302
H  0.705018 2.339653 -2.522195
H  0.830095 -0.174227 -2.198269
H  -0.637663 -1.134621 -2.026099
H  -0.150382 -0.51672 -3.60294
H  1.110085 2.331973 1.321552
H  0.652368 1.67315 -0.235158
H  2.32218 2.16362 0.045897
H  4.54804 0.931163 0.476179
H  4.845714 -0.742904 0.07969
H  3.256569 0.766115 -3.531152
elementType: O C H
totalener: -964.15778201 hartree
nucrepener: 1861.50230051 hartree
electener: -2825.66008252 hartree
oneelecener: -5007.99358202 hartree
twoeener: 2182.33349950 hartree
cpcmener: -0.03671651 hartree
kineticenergy: 959.77985040 hartree
xcener: -94.702331230923 hartree
chargesum: -0.0000000
charge: -0.278069 -0.481177 -0.479548 0.144668 -0.027262 -0.120028 -0.294425 -0.270037 -0.252911 0.394430 -0.021386 0.228116 -0.227132 -0.258809 -0.137909 -0.005104 -0.098410 0.309833 -0.269066 -0.080835 -0.426053 -0.006527 0.108490 0.099901 0.097611 0.103157 0.085008 0.095313 0.087546 0.095932 0.126692 0.110057 0.100970 0.111251 0.106766 0.095001 0.080645 0.065189 0.095744 0.115348 0.127614 0.102056 0.109118 0.136047 0.108291 0.293895
qa: -0.2781 -0.4812 -0.4795 0.1447 -0.0273 -0.1200 -0.2944 -0.2700 -0.2529 0.3944 -0.0214 0.2281 -0.2271 -0.2588 -0.1379 -0.0051 -0.0984 0.3098 -0.2691 -0.0808 -0.4261 -0.0065 0.1085 0.0999 0.0976 0.1032 0.0850 0.0953 0.0875 0.0959 0.1267 0.1101 0.1010 0.1113 0.1068 0.0950 0.0806 0.0652 0.0957 0.1153 0.1276 0.1021 0.1091 0.1360 0.1083 0.2939
va: 2.1165 2.0069 2.0197 3.7571 3.8169 3.8343 3.8952 3.8992 3.8240 4.1136 3.6994 3.7909 3.9139 3.9421 3.9221 3.6267 3.5467 4.0274 3.9350 3.8752 3.8060 3.5901 1.0054 1.0274 0.9996 1.0012 1.0143 1.0023 1.0039 1.0023 1.0011 1.0231 1.0308 1.0174 0.9950 1.0076 0.9996 1.0078 1.0141 1.0017 1.0094 0.9995 0.9987 0.9878 1.0225 0.9440
dispcorr: -0.026492985 hartree
energy: -964.184274996348
dipole: -16.57934 15.44047 -1.13886 8.51890 -7.78989 0.72901 -11.24965 10.84238 -0.40727
magnitude: 1.41221 au
magnitude: 3.58955 debye
