program: Orca
programVersion: 5.0.2
elementType: O O O C C C C C C C C C C C C C C C C C C C H H H H H H H H H H H H H H H H H H H H H H H H
charge: 0
multiplicity: 1
keywords: wb97x-d3
keywords: def2-TZVPP
keywords: def2/J RIJCOSX
keywords: DEFGRID2
keywords: scfconv7
keywords: smallprint printgap noloewdin
keywords: NOSOSCF
formula: C19H24O3
InChI: InChI=1/C19H24O3/c1-7-8-13-12(4)16(10-15(13)20)22-18(21)17-14(9-11(2)3)19(17,5)6/h1,9,14,16-17H,8,10H2,2-6H3
46 atoms
O  -0.26693 -0.490816 1.205188
O  -1.256851 1.359218 0.417763
O  3.956719 -0.846845 3.08758
C  -3.857336 -0.356887 0.35509
C  -3.190335 -0.562953 -0.95861
C  -2.391431 -0.75074 0.341924
C  -4.303391 1.012622 0.803043
C  -4.788352 -1.449724 0.826918
C  -2.912095 0.543545 -1.904165
C  -1.291535 0.17165 0.646001
C  -2.124769 0.447733 -2.979422
C  0.948231 0.205423 1.482638
C  -1.944834 1.603961 -3.914327
C  -1.357274 -0.786415 -3.340484
C  1.606793 -0.342204 2.740726
C  1.955975 -0.029897 0.384228
C  3.134358 -0.435626 0.880995
C  3.040491 -0.578071 2.335609
C  1.619516 0.229852 -1.034247
C  4.399872 -0.696953 0.119945
C  5.029444 0.534576 -0.341479
C  5.531594 1.55624 -0.727595
H  -3.39695 -1.518251 -1.431737
H  -2.188858 -1.78062 0.610225
H  -5.320416 1.19326 0.450231
H  -4.322213 1.066483 1.89283
H  -3.683983 1.828937 0.443965
H  -5.795682 -1.283388 0.440511
H  -4.462676 -2.435168 0.492191
H  -4.848869 -1.468925 1.916522
H  -3.416369 1.488001 -1.725988
H  0.755368 1.276233 1.576844
H  1.164386 -1.297217 3.035043
H  1.538183 0.330033 3.595573
H  -0.895478 1.906453 -3.962155
H  -2.233708 1.334562 -4.9335
H  -2.532846 2.471219 -3.614601
H  -0.298342 -0.552219 -3.475109
H  -1.430491 -1.575616 -2.594672
H  -1.703191 -1.192335 -4.294726
H  0.769305 -0.379275 -1.348354
H  2.450004 0.013466 -1.702575
H  1.329028 1.27304 -1.174645
H  5.103143 -1.247751 0.748396
H  4.195091 -1.337298 -0.741733
H  5.979812 2.461843 -1.069635
elementType: O C H
totalener: -964.16062482 hartree
nucrepener: 1795.58549348 hartree
electener: -2759.74611830 hartree
oneelecener: -4875.97285760 hartree
twoeener: 2116.22673931 hartree
cpcmener: -0.03983264 hartree
kineticenergy: 959.76851778 hartree
xcener: -94.699427658763 hartree
chargesum: -0.0000000
charge: -0.301190 -0.490023 -0.482265 0.135468 -0.023113 -0.085503 -0.299005 -0.260220 -0.251926 0.379415 -0.029644 0.247148 -0.227951 -0.295605 -0.136018 -0.006941 -0.097107 0.318452 -0.266272 -0.108111 -0.462942 0.047186 0.114356 0.092592 0.101994 0.102205 0.090604 0.095103 0.088009 0.096221 0.127258 0.108461 0.105294 0.099466 0.094387 0.095616 0.089731 0.096032 0.095759 0.116422 0.121620 0.105152 0.121122 0.111132 0.135650 0.291984
qa: -0.3012 -0.4900 -0.4823 0.1355 -0.0231 -0.0855 -0.2990 -0.2602 -0.2519 0.3794 -0.0296 0.2471 -0.2280 -0.2956 -0.1360 -0.0069 -0.0971 0.3185 -0.2663 -0.1081 -0.4629 0.0472 0.1144 0.0926 0.1020 0.1022 0.0906 0.0951 0.0880 0.0962 0.1273 0.1085 0.1053 0.0995 0.0944 0.0956 0.0897 0.0960 0.0958 0.1164 0.1216 0.1052 0.1211 0.1111 0.1356 0.2920
va: 2.1194 1.9915 2.0159 3.7671 3.7871 3.8663 3.8966 3.8925 3.8278 4.0975 3.6946 3.7825 3.9277 3.9530 3.9224 3.7225 3.5294 4.0308 3.9325 3.8814 3.8225 3.5260 1.0016 1.0320 0.9985 0.9996 1.0184 1.0021 1.0045 1.0024 0.9998 1.0309 1.0266 1.0244 0.9961 0.9959 1.0075 0.9935 1.0030 0.9989 0.9973 1.0040 1.0018 1.0181 0.9886 0.9437
dispcorr: -0.023126424 hartree
energy: -964.183751242424
dipole: -22.12878 20.28666 -1.84212 0.18557 -1.00640 -0.82083 -16.27406 14.65743 -1.61663
magnitude: 2.58470 au
magnitude: 6.56978 debye
