program: Orca
programVersion: 5.0.2
elementType: O O O C C C C C C C C C C C C C C C C C C C H H H H H H H H H H H H H H H H H H H H H H H H
charge: 0
multiplicity: 1
keywords: wb97x-d3
keywords: def2-TZVPP
keywords: def2/J RIJCOSX
keywords: DEFGRID2
keywords: scfconv7
keywords: smallprint printgap noloewdin
keywords: NOSOSCF
formula: C19H24O3
InChI: InChI=1/C19H24O3/c1-7-8-13-12(4)16(10-15(13)20)22-18(21)17-14(9-11(2)3)19(17,5)6/h1,9,14,16-17H,8,10H2,2-6H3
46 atoms
O  0.436892 -0.066315 0.077629
O  -1.375773 -0.197962 1.370823
O  3.859731 -1.386462 2.844248
C  -2.716034 -1.663376 -1.016391
C  -2.841927 -0.23649 -1.449966
C  -1.491909 -0.77326 -0.967008
C  -3.406151 -2.143822 0.235769
C  -2.682928 -2.706858 -2.107749
C  -3.603698 0.788145 -0.706134
C  -0.859008 -0.326243 0.284142
C  -4.593356 1.522315 -1.226382
C  1.216992 0.371992 1.19252
C  -5.270602 2.586454 -0.416654
C  -5.10208 1.386085 -2.631196
C  1.625373 -0.752444 2.136808
C  2.507559 0.910196 0.636822
C  3.573377 0.32825 1.204481
C  3.134915 -0.698189 2.153985
C  2.49553 1.969507 -0.397651
C  5.019057 0.63495 0.949845
C  5.431709 0.292268 -0.405892
C  5.75532 0.011812 -1.52916
H  -2.842913 -0.098109 -2.52554
H  -0.776692 -0.935101 -1.764512
H  -3.57307 -1.369202 0.978656
H  -4.383582 -2.549062 -0.032953
H  -2.840654 -2.948523 0.708619
H  -3.695947 -3.011266 -2.377363
H  -2.196469 -2.334374 -3.009915
H  -2.143162 -3.597626 -1.780421
H  -3.334578 0.971086 0.327752
H  0.688741 1.172573 1.718122
H  1.302908 -1.730859 1.773255
H  1.226348 -0.630407 3.143962
H  -4.834134 2.691917 0.576366
H  -5.20411 3.555747 -0.918266
H  -6.336447 2.374698 -0.299788
H  -4.824397 0.447143 -3.106673
H  -6.1918 1.452762 -2.648552
H  -4.733789 2.200148 -3.261971
H  1.729665 2.715144 -0.179271
H  2.253318 1.54344 -1.374503
H  3.456724 2.472413 -0.48636
H  5.21167 1.697531 1.121471
H  5.642474 0.09281 1.664232
H  6.046482 -0.232901 -2.525969
elementType: O C H
totalener: -964.16072969 hartree
nucrepener: 1746.81443828 hartree
electener: -2710.97516797 hartree
oneelecener: -4778.58040272 hartree
twoeener: 2067.60523475 hartree
cpcmener: -0.03880691 hartree
kineticenergy: 959.76428824 hartree
xcener: -94.696589930799 hartree
chargesum: -0.0000000
charge: -0.299214 -0.497627 -0.479349 0.145334 0.021470 -0.114272 -0.288841 -0.269205 -0.321967 0.413424 -0.011376 0.244720 -0.224485 -0.274584 -0.145007 -0.016301 -0.085913 0.316247 -0.275581 -0.095027 -0.464052 0.041550 0.115401 0.097822 0.095444 0.096755 0.104655 0.093409 0.089349 0.095261 0.122206 0.107324 0.107538 0.106746 0.088317 0.094330 0.094554 0.094859 0.094831 0.104034 0.119741 0.117064 0.103147 0.135788 0.109988 0.291493
qa: -0.2992 -0.4976 -0.4793 0.1453 0.0215 -0.1143 -0.2888 -0.2692 -0.3220 0.4134 -0.0114 0.2447 -0.2245 -0.2746 -0.1450 -0.0163 -0.0859 0.3162 -0.2756 -0.0950 -0.4641 0.0415 0.1154 0.0978 0.0954 0.0968 0.1047 0.0934 0.0893 0.0953 0.1222 0.1073 0.1075 0.1067 0.0883 0.0943 0.0946 0.0949 0.0948 0.1040 0.1197 0.1171 0.1031 0.1358 0.1100 0.2915
va: 2.1326 1.9951 2.0224 3.6801 3.7558 3.9533 3.9021 3.9127 3.8846 4.0430 3.7267 3.7794 3.9279 3.9479 3.9020 3.7217 3.5405 4.0243 3.9534 3.8731 3.8224 3.5278 1.0028 1.0283 1.0131 1.0014 1.0001 1.0023 1.0045 1.0021 1.0238 1.0167 1.0230 1.0224 1.0089 0.9944 0.9964 1.0043 0.9986 0.9947 1.0013 0.9989 0.9998 0.9878 1.0213 0.9440
dispcorr: -0.021007043 hartree
energy: -964.181736732814
dipole: -28.01460 26.82449 -1.19011 4.01156 -2.54558 1.46598 -13.74808 11.57844 -2.16964
magnitude: 2.87625 au
magnitude: 7.31084 debye
