program: Orca
programVersion: 5.0.2
elementType: O O O C C C C C C C C C C C C C C C C C C C H H H H H H H H H H H H H H H H H H H H H H H H
charge: 0
multiplicity: 1
keywords: wb97x-d3
keywords: def2-TZVPP
keywords: def2/J RIJCOSX
keywords: DEFGRID2
keywords: scfconv7
keywords: smallprint printgap noloewdin
keywords: NOSOSCF
formula: C19H24O3
InChI: InChI=1/C19H24O3/c1-7-8-13-12(4)16(10-15(13)20)22-18(21)17-14(9-11(2)3)19(17,5)6/h1,9,14,16-17H,8,10H2,2-6H3
46 atoms
O  0.380081 0.261418 0.068824
O  -0.893124 -1.525174 0.456427
O  4.603764 -1.608505 0.252356
C  -2.457242 -0.580486 -2.078439
C  -3.157711 0.107308 -0.950045
C  -1.632219 0.190014 -1.062146
C  -2.402763 -2.085637 -2.158866
C  -2.549413 0.073015 -3.437202
C  -3.844302 -0.606521 0.143039
C  -0.725757 -0.469109 -0.110882
C  -5.040822 -0.289375 0.652891
C  1.368729 -0.255171 0.962914
C  -5.629687 -1.101616 1.76795
C  -5.906246 0.847653 0.201493
C  2.187127 -1.40565 0.386172
C  2.361798 0.846269 1.215884
C  3.620214 0.433757 1.00562
C  3.619486 -0.945202 0.512914
C  1.912306 2.183329 1.665586
C  4.879343 1.222019 1.200996
C  5.116565 2.141636 0.093975
C  5.306394 2.903287 -0.816227
H  -3.615424 1.049685 -1.228274
H  -1.262674 1.147485 -1.409084
H  -2.448199 -2.58919 -1.197774
H  -3.248303 -2.441407 -2.750574
H  -1.491983 -2.410966 -2.664823
H  -3.451015 -0.256121 -3.957297
H  -2.58531 1.16055 -3.3645
H  -1.691544 -0.192503 -4.058009
H  -3.343489 -1.469283 0.565132
H  0.893851 -0.532709 1.908694
H  1.958744 -1.579111 -0.668247
H  2.035841 -2.348181 0.912129
H  -5.828647 -0.476672 2.642738
H  -6.590043 -1.534148 1.474555
H  -4.97447 -1.915576 2.078771
H  -6.88151 0.474274 -0.122044
H  -6.101534 1.535001 1.029262
H  -5.489878 1.42766 -0.619825
H  1.490858 2.743521 0.82762
H  2.72822 2.773794 2.078587
H  1.125936 2.098545 2.417038
H  4.830853 1.788923 2.134071
H  5.730993 0.544347 1.296931
H  5.451783 3.572439 -1.634362
elementType: O C H
totalener: -964.16192658 hartree
nucrepener: 1745.75118022 hartree
electener: -2709.91310680 hartree
oneelecener: -4776.52112330 hartree
twoeener: 2066.60801650 hartree
cpcmener: -0.03991179 hartree
kineticenergy: 959.76245155 hartree
xcener: -94.697120346543 hartree
chargesum: 0.0000000
charge: -0.301455 -0.498049 -0.480623 0.102631 0.027414 -0.079364 -0.286036 -0.262396 -0.298261 0.408621 -0.055463 0.242696 -0.220048 -0.254470 -0.143400 -0.019933 -0.088687 0.318118 -0.267447 -0.106001 -0.456069 0.039074 0.120655 0.097035 0.094586 0.098961 0.104203 0.095687 0.088316 0.094233 0.124896 0.109478 0.107138 0.105255 0.093415 0.093825 0.088753 0.096237 0.096770 0.089432 0.115936 0.104607 0.119079 0.136214 0.113051 0.291384
qa: -0.3015 -0.4980 -0.4806 0.1026 0.0274 -0.0794 -0.2860 -0.2624 -0.2983 0.4086 -0.0555 0.2427 -0.2200 -0.2545 -0.1434 -0.0199 -0.0887 0.3181 -0.2674 -0.1060 -0.4561 0.0391 0.1207 0.0970 0.0946 0.0990 0.1042 0.0957 0.0883 0.0942 0.1249 0.1095 0.1071 0.1053 0.0934 0.0938 0.0888 0.0962 0.0968 0.0894 0.1159 0.1046 0.1191 0.1362 0.1131 0.2914
va: 2.1337 1.9961 2.0207 3.7119 3.7390 3.8840 3.9061 3.9104 3.8433 4.0546 3.7847 3.7881 3.9212 3.9384 3.8953 3.7431 3.5291 4.0318 3.9503 3.8739 3.8282 3.5358 1.0023 1.0274 1.0128 1.0009 0.9989 1.0012 1.0055 1.0021 1.0229 1.0157 1.0228 1.0241 0.9960 0.9965 1.0088 0.9969 0.9967 1.0132 0.9994 1.0019 1.0005 0.9890 1.0172 0.9440
dispcorr: -0.020795419 hartree
energy: -964.182722002131
dipole: -30.42385 28.39032 -2.03354 2.73042 -0.62101 2.10942 -3.91390 4.17655 0.26265
magnitude: 2.94175 au
magnitude: 7.47733 debye
