program: Orca
programVersion: 5.0.2
elementType: O O O C C C C C C C C C C C C C C C C C C C H H H H H H H H H H H H H H H H H H H H H H H H
charge: 0
multiplicity: 1
keywords: wb97x-d3
keywords: def2-TZVPP
keywords: def2/J RIJCOSX
keywords: DEFGRID2
keywords: scfconv7
keywords: smallprint printgap noloewdin
keywords: NOSOSCF
formula: C19H24O3
InChI: InChI=1/C19H24O3/c1-7-8-13-12(4)16(10-15(13)20)22-18(21)17-14(9-11(2)3)19(17,5)6/h1,9,14,16-17H,8,10H2,2-6H3
46 atoms
O  -0.47014 -0.420331 0.841457
O  -1.544951 -0.182358 2.787065
O  3.834131 -1.518494 -0.228122
C  -2.859838 0.81847 -0.500598
C  -3.069729 -0.65913 -0.547637
C  -2.782081 0.011598 0.789357
C  -1.63889 1.473378 -1.101096
C  -4.091955 1.685674 -0.611427
C  -2.131927 -1.637872 -1.157684
C  -1.555169 -0.202143 1.574239
C  -1.820848 -1.711374 -2.453816
C  0.784058 -0.716306 1.460254
C  -0.88926 -2.769766 -2.962377
C  -2.348964 -0.777785 -3.497986
C  1.558669 -1.699871 0.593479
C  1.646208 0.520191 1.517474
C  2.825152 0.326781 0.908058
C  2.882712 -1.023335 0.342484
C  1.180091 1.749623 2.199682
C  3.956941 1.303112 0.78941
C  3.627481 2.423793 -0.08218
C  3.347559 3.35113 -0.793656
H  -4.113851 -0.957008 -0.618658
H  -3.638347 0.122988 1.44375
H  -1.911103 1.927917 -2.05487
H  -1.270978 2.274939 -0.456987
H  -0.817817 0.789293 -1.293527
H  -4.334676 1.867001 -1.66061
H  -4.961562 1.223047 -0.143528
H  -3.931615 2.655191 -0.135877
H  -1.718148 -2.391676 -0.494292
H  0.623543 -1.107187 2.467042
H  1.0580 -1.881452 -0.360889
H  1.703155 -2.667884 1.073738
H  -0.530626 -3.420079 -2.164809
H  -1.375091 -3.394261 -3.716145
H  -0.019511 -2.321028 -3.448868
H  -2.831269 -1.34317 -4.299479
H  -3.074617 -0.064369 -3.112293
H  -1.537024 -0.215936 -3.965998
H  1.974715 2.483396 2.316761
H  0.77718 1.515586 3.185354
H  0.374588 2.220632 1.63071
H  4.229988 1.684623 1.776405
H  4.843332 0.79551 0.403266
H  3.105448 4.180082 -1.419902
elementType: O C H
totalener: -964.15652598 hartree
nucrepener: 1848.66320585 hartree
electener: -2812.81973183 hartree
oneelecener: -4981.82119121 hartree
twoeener: 2169.00145938 hartree
cpcmener: -0.03905203 hartree
kineticenergy: 959.78179008 hartree
xcener: -94.702328415099 hartree
chargesum: -0.0000000
charge: -0.261761 -0.503685 -0.480253 0.084220 0.005628 -0.097489 -0.299826 -0.273328 -0.289944 0.414796 -0.009420 0.197299 -0.247392 -0.262618 -0.118738 -0.002516 -0.097348 0.313513 -0.257377 -0.097858 -0.465581 0.042791 0.114865 0.093241 0.099773 0.115288 0.096320 0.091581 0.088289 0.098862 0.120661 0.112042 0.094718 0.106571 0.089380 0.106599 0.096978 0.108020 0.092146 0.101741 0.103007 0.119790 0.119796 0.136134 0.109245 0.291840
qa: -0.2618 -0.5037 -0.4803 0.0842 0.0056 -0.0975 -0.2998 -0.2733 -0.2899 0.4148 -0.0094 0.1973 -0.2474 -0.2626 -0.1187 -0.0025 -0.0973 0.3135 -0.2574 -0.0979 -0.4656 0.0428 0.1149 0.0932 0.0998 0.1153 0.0963 0.0916 0.0883 0.0989 0.1207 0.1120 0.0947 0.1066 0.0894 0.1066 0.0970 0.1080 0.0921 0.1017 0.1030 0.1198 0.1198 0.1361 0.1092 0.2918
va: 2.0993 1.9921 2.0216 3.6896 3.7855 3.8785 3.8768 3.9123 3.8702 4.1174 3.6538 3.7841 3.9265 3.9369 3.9143 3.6910 3.5228 4.0389 3.9371 3.8843 3.8243 3.5313 1.0046 1.0265 1.0004 1.0014 1.0101 1.0034 1.0059 0.9999 1.0110 1.0305 1.0327 1.0215 1.0047 0.9980 0.9955 1.0005 1.0048 0.9952 1.0029 1.0093 0.9945 0.9880 1.0215 0.9440
dispcorr: -0.025369207 hartree
energy: -964.181895186357
dipole: -15.90072 14.46786 -1.43286 3.72207 -2.88684 0.83524 -13.82759 13.48021 -0.34739
magnitude: 1.69452 au
magnitude: 4.30712 debye
