program: Orca
programVersion: 5.0.2
elementType: O O O C C C C C C C C C C C C C C C C C C C H H H H H H H H H H H H H H H H H H H H H H H H
charge: 0
multiplicity: 1
keywords: wb97x-d3
keywords: def2-TZVPP
keywords: def2/J RIJCOSX
keywords: DEFGRID2
keywords: scfconv7
keywords: smallprint printgap noloewdin
keywords: NOSOSCF
formula: C19H24O3
InChI: InChI=1/C19H24O3/c1-7-8-13-12(4)16(10-15(13)20)22-18(21)17-14(9-11(2)3)19(17,5)6/h1,9,14,16-17H,8,10H2,2-6H3
46 atoms
O  -0.472863 -0.431273 0.859951
O  -1.564567 -0.204792 2.797824
O  3.834674 -1.530101 -0.190001
C  -2.861256 0.815906 -0.485247
C  -3.052054 -0.66289 -0.56184
C  -2.786905 -0.014408 0.790375
C  -1.64133 1.495965 -1.059042
C  -4.102334 1.670201 -0.595153
C  -2.096877 -1.617323 -1.183238
C  -1.564645 -0.220387 1.584785
C  -1.774563 -1.659843 -2.478035
C  0.779894 -0.71788 1.485836
C  -0.82309 -2.693595 -3.000154
C  -2.307795 -0.712291 -3.507186
C  1.559879 -1.710295 0.633967
C  1.63757 0.522145 1.528087
C  2.818674 0.324641 0.924161
C  2.881138 -1.031569 0.374283
C  1.163191 1.760652 2.187863
C  3.943951 1.306406 0.789334
C  3.613787 2.393194 -0.12431
C  3.328894 3.2897 -0.872686
H  -4.091736 -0.971907 -0.648902
H  -3.651343 0.073999 1.437573
H  -1.902947 1.949766 -2.016129
H  -1.301806 2.301433 -0.404296
H  -0.803541 0.8287 -1.237637
H  -4.972738 1.186874 -0.150158
H  -3.961187 2.631266 -0.096974
H  -4.332225 1.870961 -1.643689
H  -1.679065 -2.379447 -0.531969
H  0.617901 -1.095646 2.497329
H  1.061427 -1.907181 -0.318493
H  1.70765 -2.670905 1.12792
H  0.047667 -2.22136 -3.462351
H  -0.46703 -3.359398 -2.214172
H  -1.290328 -3.304588 -3.776492
H  -1.50115 -0.124519 -3.952389
H  -2.769603 -1.268081 -4.327349
H  -3.051539 -0.021804 -3.114212
H  0.735107 1.539647 3.166185
H  0.374477 2.230063 1.593873
H  1.959858 2.491051 2.31543
H  4.199219 1.724251 1.766491
H  4.840263 0.794757 0.432175
H  3.070316 4.082298 -1.538142
elementType: O C H
totalener: -964.15650580 hartree
nucrepener: 1849.98619362 hartree
electener: -2814.14269942 hartree
oneelecener: -4984.45533337 hartree
twoeener: 2170.31263394 hartree
cpcmener: -0.03921057 hartree
kineticenergy: 959.77729754 hartree
xcener: -94.701429976037 hartree
chargesum: -0.0000000
charge: -0.261354 -0.503853 -0.480355 0.085329 0.005222 -0.098545 -0.302979 -0.272966 -0.290409 0.415855 -0.008235 0.196280 -0.246800 -0.263414 -0.118449 -0.002862 -0.098083 0.314309 -0.258458 -0.097818 -0.462597 0.039006 0.115158 0.093267 0.099689 0.116278 0.097034 0.088476 0.098551 0.091508 0.120746 0.112414 0.093972 0.106462 0.097123 0.089171 0.106123 0.101647 0.107940 0.092692 0.119365 0.120966 0.104910 0.136206 0.109633 0.291842
qa: -0.2614 -0.5039 -0.4804 0.0853 0.0052 -0.0985 -0.3030 -0.2730 -0.2904 0.4159 -0.0082 0.1963 -0.2468 -0.2634 -0.1184 -0.0029 -0.0981 0.3143 -0.2585 -0.0978 -0.4626 0.0390 0.1152 0.0933 0.0997 0.1163 0.0970 0.0885 0.0986 0.0915 0.1207 0.1124 0.0940 0.1065 0.0971 0.0892 0.1061 0.1016 0.1079 0.0927 0.1194 0.1210 0.1049 0.1362 0.1096 0.2918
va: 2.0985 1.9921 2.0215 3.6894 3.7842 3.8773 3.8771 3.9118 3.8706 4.1187 3.6525 3.7853 3.9263 3.9369 3.9142 3.6916 3.5221 4.0383 3.9347 3.8831 3.8228 3.5344 1.0045 1.0266 1.0008 1.0008 1.0103 1.0058 1.0001 1.0036 1.0110 1.0306 1.0329 1.0216 0.9955 1.0046 0.9980 0.9952 1.0005 1.0048 1.0099 0.9941 1.0024 0.9882 1.0210 0.9440
dispcorr: -0.025416167 hartree
energy: -964.181921970331
dipole: -15.77687 14.34303 -1.43384 4.05887 -3.18831 0.87056 -13.91697 13.55711 -0.35986
magnitude: 1.71560 au
magnitude: 4.36071 debye
