program: Orca
programVersion: 5.0.2
elementType: O O O C C C C C C C C C C C C C C C C C C C H H H H H H H H H H H H H H H H H H H H H H H H
charge: 0
multiplicity: 1
keywords: wb97x-d3
keywords: def2-TZVPP
keywords: def2/J RIJCOSX
keywords: DEFGRID2
keywords: scfconv7
keywords: smallprint printgap noloewdin
keywords: NOSOSCF
formula: C19H24O3
InChI: InChI=1/C19H24O3/c1-7-8-13-12(4)16(10-15(13)20)22-18(21)17-14(9-11(2)3)19(17,5)6/h1,9,14,16-17H,8,10H2,2-6H3
46 atoms
O  -0.140041 -0.710204 0.907925
O  -1.405759 1.139892 0.875361
O  3.997788 -1.443552 2.791515
C  -3.714996 -0.787592 0.065268
C  -3.094273 -0.340555 -1.210383
C  -2.207695 -0.902141 -0.091984
C  -4.331428 0.203385 1.021326
C  -4.440397 -2.112816 0.056618
C  -3.04186 1.082552 -1.625099
C  -1.255493 -0.029727 0.605813
C  -2.190763 1.579797 -2.526741
C  0.926457 -0.054511 1.597405
C  -2.239943 3.019734 -2.935881
C  -1.128006 0.765928 -3.198182
C  1.618267 -1.030244 2.539696
C  2.000186 0.382624 0.63209
C  3.207301 -0.07016 1.00352
C  3.081935 -0.91545 2.192238
C  1.681101 1.220188 -0.54632
C  4.523136 0.192408 0.334535
C  4.677909 -0.588953 -0.886703
C  4.780263 -1.231027 -1.898046
H  -3.177554 -1.045323 -2.033062
H  -1.83944 -1.906897 -0.260205
H  -4.270849 -0.167892 2.045878
H  -3.878937 1.19039 0.999483
H  -5.389512 0.324249 0.781292
H  -5.482215 -1.975688 -0.239308
H  -3.988192 -2.820904 -0.63855
H  -4.433829 -2.567282 1.048984
H  -3.774941 1.753157 -1.187109
H  0.545013 0.814708 2.137409
H  1.290189 -2.056812 2.361466
H  1.444953 -0.80932 3.59288
H  -3.053105 3.558888 -2.450445
H  -1.303031 3.526156 -2.689685
H  -2.366938 3.116638 -4.017126
H  -0.160028 1.267825 -3.129298
H  -1.017985 -0.232646 -2.778472
H  -1.340356 0.658937 -4.265459
H  1.071132 2.079679 -0.263669
H  1.100699 0.644486 -1.271681
H  2.575315 1.581068 -1.050963
H  4.618035 1.253712 0.092032
H  5.340867 -0.038915 1.020937
H  4.86811 -1.800658 -2.795941
elementType: O C H
totalener: -964.16040294 hartree
nucrepener: 1801.64992491 hartree
electener: -2765.81032785 hartree
oneelecener: -4888.21968546 hartree
twoeener: 2122.40935761 hartree
cpcmener: -0.03974179 hartree
kineticenergy: 959.76786144 hartree
xcener: -94.698665580984 hartree
chargesum: 0.0000000
charge: -0.299235 -0.492358 -0.481795 0.132716 -0.012891 -0.101048 -0.300961 -0.263547 -0.273259 0.396609 -0.010633 0.243650 -0.225364 -0.301895 -0.133765 0.006287 -0.100620 0.312906 -0.285330 -0.103903 -0.456919 0.035684 0.115996 0.094402 0.103262 0.091164 0.101279 0.094316 0.088710 0.096197 0.127131 0.106391 0.104406 0.101853 0.089179 0.095275 0.095696 0.094782 0.097540 0.118740 0.121619 0.128026 0.109575 0.135311 0.112477 0.292343
qa: -0.2992 -0.4924 -0.4818 0.1327 -0.0129 -0.1010 -0.3010 -0.2635 -0.2733 0.3966 -0.0106 0.2436 -0.2254 -0.3019 -0.1338 0.0063 -0.1006 0.3129 -0.2853 -0.1039 -0.4569 0.0357 0.1160 0.0944 0.1033 0.0912 0.1013 0.0943 0.0887 0.0962 0.1271 0.1064 0.1044 0.1019 0.0892 0.0953 0.0957 0.0948 0.0975 0.1187 0.1216 0.1280 0.1096 0.1353 0.1125 0.2923
va: 2.1230 1.9893 2.0173 3.7521 3.7979 3.8553 3.8982 3.8955 3.8443 4.0802 3.6770 3.7913 3.9255 3.9545 3.9127 3.6953 3.5378 4.0318 3.9246 3.8815 3.8259 3.5371 1.0029 1.0312 0.9996 1.0169 0.9985 1.0022 1.0045 1.0021 0.9987 1.0298 1.0279 1.0233 1.0075 0.9964 0.9956 0.9950 1.0020 0.9990 1.0081 0.9928 1.0050 0.9891 1.0183 0.9436
dispcorr: -0.023264766 hartree
energy: -964.183667701783
dipole: -21.38551 19.81641 -1.56910 6.33194 -5.95723 0.37471 -13.96450 12.54710 -1.41740
magnitude: 2.14744 au
magnitude: 5.45836 debye
