program: Orca
programVersion: 5.0.2
elementType: O O O C C C C C C C C C C C C C C C C C C C H H H H H H H H H H H H H H H H H H H H H H H H
charge: 0
multiplicity: 1
keywords: wb97x-d3
keywords: def2-TZVPP
keywords: def2/J RIJCOSX
keywords: DEFGRID2
keywords: scfconv7
keywords: smallprint printgap noloewdin
keywords: NOSOSCF
formula: C19H24O3
InChI: InChI=1/C19H24O3/c1-7-8-13-12(4)16(10-15(13)20)22-18(21)17-14(9-11(2)3)19(17,5)6/h1,9,14,16-17H,8,10H2,2-6H3
46 atoms
O  -0.522992 -0.296535 0.968126
O  -1.623891 -1.388978 2.565132
O  3.7403 -1.933188 1.626374
C  -3.345745 0.233106 -0.144426
C  -2.659646 -0.790035 -0.989091
C  -2.729431 -0.995584 0.515397
C  -2.75421 1.60311 0.080945
C  -4.855423 0.246228 -0.166427
C  -1.381061 -0.582619 -1.718164
C  -1.592601 -0.915964 1.448486
C  -1.176392 0.301617 -2.697706
C  0.63067 -0.1692 1.80171
C  0.15708 0.400262 -3.37589
C  -2.212563 1.258518 -3.201106
C  1.390139 -1.472117 2.027583
C  1.590581 0.717899 1.055547
C  2.800234 0.152977 0.93714
C  2.789314 -1.181991 1.538201
C  1.16888 2.040391 0.538262
C  4.007034 0.744729 0.274338
C  3.829682 0.852968 -1.168961
C  3.652425 0.945283 -2.354804
H  -3.342673 -1.464592 -1.502112
H  -3.450598 -1.730499 0.853404
H  -3.250231 2.323344 -0.571368
H  -2.922434 1.93081 1.10886
H  -1.689231 1.665203 -0.124097
H  -5.269977 -0.754816 -0.29013
H  -5.258087 0.664205 0.758042
H  -5.216962 0.861111 -0.9935
H  -0.566784 -1.254811 -1.466708
H  0.346257 0.304765 2.745806
H  0.973994 -2.296813 1.444003
H  1.403593 -1.785293 3.071405
H  0.068668 0.22311 -4.450935
H  0.575191 1.40438 -3.262722
H  0.87739 -0.311627 -2.972389
H  -3.1912 1.112769 -2.747915
H  -1.906927 2.293053 -3.025661
H  -2.328136 1.153543 -4.283035
H  2.014907 2.714805 0.411147
H  0.440904 2.512163 1.198415
H  0.693073 1.925613 -0.439959
H  4.212044 1.737665 0.684034
H  4.888269 0.136321 0.489121
H  3.503976 1.022852 -3.408539
elementType: O C H
totalener: -964.15767733 hartree
nucrepener: 1864.30764387 hartree
electener: -2828.46532120 hartree
oneelecener: -5012.99729499 hartree
twoeener: 2184.53197379 hartree
cpcmener: -0.04099515 hartree
kineticenergy: 959.77855460 hartree
xcener: -94.701894609243 hartree
chargesum: -0.0000000
charge: -0.269646 -0.502881 -0.480102 0.074863 0.023806 -0.094856 -0.286628 -0.276263 -0.269463 0.414965 -0.020310 0.222393 -0.252152 -0.262125 -0.136903 -0.003382 -0.094769 0.312124 -0.315284 -0.088259 -0.437129 0.002322 0.114895 0.095351 0.100769 0.119774 0.083300 0.088853 0.098314 0.091897 0.111922 0.114914 0.108951 0.107335 0.109523 0.092228 0.087903 0.093659 0.100873 0.107908 0.126398 0.124065 0.116780 0.136980 0.110233 0.296855
qa: -0.2696 -0.5029 -0.4801 0.0749 0.0238 -0.0949 -0.2866 -0.2763 -0.2695 0.4150 -0.0203 0.2224 -0.2522 -0.2621 -0.1369 -0.0034 -0.0948 0.3121 -0.3153 -0.0883 -0.4371 0.0023 0.1149 0.0954 0.1008 0.1198 0.0833 0.0889 0.0983 0.0919 0.1119 0.1149 0.1090 0.1073 0.1095 0.0922 0.0879 0.0937 0.1009 0.1079 0.1264 0.1241 0.1168 0.1370 0.1102 0.2969
va: 2.1202 1.9998 2.0218 3.7195 3.7516 3.8908 3.8858 3.9143 3.8449 4.0952 3.6725 3.7729 3.9291 3.9351 3.8977 3.6952 3.5230 4.0380 3.9557 3.8760 3.8311 3.5812 1.0049 1.0266 1.0004 1.0010 1.0015 1.0056 1.0004 1.0028 1.0182 1.0139 1.0206 1.0230 0.9995 0.9926 1.0011 1.0049 0.9951 1.0010 0.9985 1.0024 0.9824 0.9899 1.0208 0.9408
dispcorr: -0.026818239 hartree
energy: -964.184495569731
dipole: -17.13285 15.56387 -1.56898 13.64562 -11.15507 2.49055 -15.54058 14.24843 -1.29215
magnitude: 3.21469 au
magnitude: 8.17109 debye
