program: Gaussian 09
title: 000007204
version: EM64L-G09RevD.01
frameworkgroup: C1[X(C9H9ClO3)]
method: RPBEPBE
basis: SDD
operation: Freq
keyword: #p
keyword: freq=noraman
keyword: PBEPBE/SDD
title: #p freq=noraman PBEPBE/SDD
converged: YES YES NO NO
title: Mulliken charges:
elementType: Cl O O O C C C C C C C C C H H H H H H H H H
charge: -0.069270 -0.249293 -0.423271 -0.190146 0.336168 0.222906 -0.367407 -0.328677 -0.774880 -0.102555 -0.240054 -0.337861 0.162508 0.262506 0.247951 0.214940 0.246688 0.247017 0.254518 0.248255 0.248386 0.391571
chargesum: 0.00000
title: Mulliken charges with hydrogens summed into heavy atoms:
elementType: Cl O O O C C C C C C C C C
charge: -0.069270 -0.249293 -0.031700 -0.190146 0.336168 0.222906 -0.104901 -0.080726 -0.066235 -0.102555 0.014464 0.158781 0.162508
polarizability: 1.73579633e+02 4.15781783e+00 1.20222801e+02 -3.24362851e-02 6.07588673e-02 5.44602016e+01
1716.lowfreq: -8.2998 -6.7155 -4.1023 -0.0026 0.0003 0.0009 24.5095 37.3720 78.7130
frequency: 24.4994 37.2337 78.7127 107.8131 121.9317 138.3708 191.3007 194.8831 231.1688 247.0802 333.3202 371.8569 421.9521 441.6933 482.1575 512.3634 548.3479 550.5362 574.1003 628.6853 647.5097 713.2509 764.4117 798.1859 857.3467 877.2124 879.1714 920.1635 996.4074 1007.0446 1007.7478 1046.2710 1055.1084 1087.6542 1130.7946 1188.5244 1201.0978 1237.7251 1258.0966 1268.4891 1366.9642 1387.1082 1393.3750 1404.9647 1447.8690 1456.4153 1471.0401 1482.3572 1591.2226 1600.2527 1705.8620 2960.7153 2988.8268 3016.3339 3068.2279 3098.3618 3156.1881 3159.2777 3177.0736 3528.1112
redmass: 10.8536 6.4250 7.1295 1.1317 3.6598 3.1339 8.9750 3.0586 4.6767 6.2453 6.3931 7.0438 5.8694 2.8947 5.0167 1.7500 3.4488 4.2750 5.4845 1.5006 8.0764 3.3902 5.8650 1.4535 6.4026 1.3445 3.9916 1.3513 1.5433 2.0334 4.1926 1.5240 2.7979 1.8963 1.9347 2.2740 1.0778 3.2040 1.7697 1.3114 2.4974 2.9083 2.9099 1.3061 1.1567 1.0442 1.2887 1.9529 7.0947 6.9754 9.3492 1.0553 1.0366 1.1037 1.0967 1.1008 1.0878 1.0927 1.0969 1.0643
irintensity: 0.5953 0.1442 1.9907 0.0108 0.9831 12.1021 0.7829 1.9521 0.4014 1.0945 0.2948 3.2862 21.3784 5.5286 0.9811 37.6891 9.0688 13.8228 13.9518 133.6172 33.2107 0.2032 10.8621 56.4211 38.1379 17.2681 2.4119 0.0022 13.3027 36.6907 258.3653 7.7467 149.0563 4.7598 72.6493 101.2289 0.5133 125.1319 1.8498 1.5234 22.5530 1.4850 15.6942 18.3028 91.5636 13.8590 2.8483 146.6784 1.4747 6.2748 212.6381 44.6831 18.5255 16.0476 12.8391 19.6698 10.6740 2.2093 4.5691 38.2180
temp: 298.150 k
press: 1.00000 atm
elementType: 17 8 8 8 6 6 6 6 6 6 6 6 6 1 1 1 1 1 1 1 1 1
symmnumber: 1
zpe: 422525.6 jmol-1
zpe.correction: 0.160932 hartree
zpe.thermalcorrener: 0.173943 hartree
zpe.thermalcorrenthalpy: 0.174887 hartree
zpe.thermalcorrgfe: 0.119421 hartree
zpe.sumelectzpe: -1033.122724 hartree
zpe.sumelectthermal: -1033.109712 hartree
zpe.sumelectthermalent: -1033.108768 hartree
zpe.sumelectthermalfe: -1033.164235 hartree
dipole: 2.6916 -1.9311 -0.0083
dipole: 3.3127
quadrupole: -82.3228 -78.4378 -84.0479
quadrupole: -10.8643 -0.0351 -0.0571
quadrupole: -0.7200 3.1650 -2.4450 -10.8643 -0.0351 -0.0571
hfenergy: -1033.2836555 hartree
pointgroup: C01 [X(C9H9Cl1O3)]
dipole: -1.0489168 -0.772895 0.0319287 debye
dipolederiv: -0.8759879 0.08927 0.0331117 0.0812304 -0.1467046 -0.0044546 0.0326893 -0.0047841 -0.0769578 -1.804366 -0.2089238 0.0570268 -0.1764503 -0.2885352 0.0059697 0.0564629 0.0075678 -0.2595486 -0.9297284 -0.5571072 0.0154704 -0.5438264 -0.8137885 0.0187493 0.0157695 0.0189723 -0.4386623 -0.7116319 0.2045116 0.0182714 -0.0379448 -0.8897635 -0.0029465 0.016492 -0.0124718 -0.2862251 -0.1764409 -0.1169911 0.0035127 -0.2628352 0.2963106 0.0155743 0.0017277 0.0078052 -0.0353169 1.5423281 0.034602 -0.0567391 -0.1397823 -0.1013394 0.0024945 -0.0589394 -0.0041099 0.068685 -0.201126 0.1168466 0.0048196 0.0216758 -0.0294553 0.0007032 0.0028582 -0.0027214 -0.1267042 -0.1997266 -0.0848227 -0.0015991 0.1901861 -0.0037163 -0.0045081 0.0028617 0.0065401 -0.1943939 -0.0289321 0.1771004 0.0068331 0.1142896 -0.0527683 -0.0053678 0.0043556 -0.0047332 0.0475704 1.1814391 -0.1634943 -0.052164 -0.0648311 0.0550097 0.0047863 -0.0502072 0.0088099 -0.0709864 -0.2357179 0.0993577 0.006187 -0.0235081 0.0044788 0.0031818 0.0040983 -0.001882 -0.1197973 0.4514576 0.2544413 0.0017919 0.8229322 0.2743766 -0.0328229 0.0121095 -0.0110641 0.3889685 1.5604957 0.2026157 -0.0526325 0.2783147 1.4589149 -0.0016145 -0.0529671 0.0017618 0.202433 0.0498229 -0.0634202 0.0033137 -0.0716301 -0.0051805 -0.000155 0.0030504 -0.000733 0.1590672 0.0012845 -0.0966577 0.0051035 -0.1116065 -0.0107511 0.0013475 0.0048386 0.0007674 0.1687235 -0.0401573 -0.1706901 0.0000029 -0.0639271 -0.0438103 -0.0020696 0.0032678 0.001019 0.1093695 0.0458736 0.0492923 -0.1018252 0.0375054 0.0440976 -0.0055667 -0.1020862 0.0427868 -0.0194219 0.0571594 0.0417804 0.0992218 0.0329934 0.0478098 0.0072603 0.0990317 -0.0423345 -0.0310176 0.0622897 0.0552343 0.0051825 0.0577487 -0.0180363 -0.0054742 0.0052891 -0.0052888 0.1688192 0.0215854 0.0126103 0.0227257 -0.1480743 -0.0083972 -0.0675965 -0.0229457 -0.0891649 -0.0325668 0.0208933 0.0196787 -0.0259446 -0.1430898 -0.0133246 0.0795523 0.0135987 0.0884647 -0.027035 0.2091859 0.1047656 0.00833 0.1506296 0.2445733 -0.0070427 0.0086446 -0.0052072 0.4049975 unknown
polarizability: 173.4864267|-3.4472315|120.1123771|-4.7413482|1.1232424|54.663832 unknown
InChI: InChI=1S/C9H9ClO3/c1-6-4-7(10)2-3-8(6)13-5-9(11)12/h2-4,11H,5H2,1H3
charge 0 multiplicity 1
22 atoms
Cl 4.799258 -0.472619 -0.137846
O  -1.169751 0.310798 0.110288
O  -4.36602 -1.396629 0.214833
O  -3.879574 0.88412 0.212738
C  1.038801 1.2038 0.039879
C  0.213824 0.040425 0.052019
C  2.437878 1.020593 -0.018749
C  0.768367 -1.2595 0.008039
C  0.413935 2.581282 0.088165
C  2.983948 -0.27898 -0.063174
C  2.172554 -1.423564 -0.050598
C  -2.068817 -0.826618 0.127178
C  -3.494331 -0.295145 0.18872
H  3.097072 1.89384 -0.029207
H  0.136869 -2.152441 0.018224
H  1.186386 3.368206 0.086339
H  -0.258382 2.742003 -0.774117
H  -0.213448 2.700544 0.989866
H  2.613564 -2.423497 -0.085015
H  -1.962692 -1.449704 -0.784625
H  -1.894968 -1.477194 1.008785
H  -5.307576 -1.077221 0.253457
