program: Orca
programVersion: 5.0.2
elementType: O O O C C C C C C C C C C C C C C C C C C C C C C H H H H H H H H H H H H H H H H H H H H H H H H H H
charge: 0
multiplicity: 1
keywords: wb97x-d3
keywords: def2-TZVPP
keywords: def2/J RIJCOSX
keywords: DEFGRID2
keywords: scfconv7
keywords: smallprint printgap noloewdin
keywords: NOSOSCF
formula: C22H26O3
InChI: InChI=1/C22H26O3/c1-15(2)10-19-20(22(19,3)4)21(23)25-14-17-12-18(24-13-17)11-16-8-6-5-7-9-16/h5-10,12-13,19-20H,11,14H2,1-4H3
51 atoms
O  2.105047 -2.017729 0.334475
O  1.819912 -1.870825 -1.878546
O  -2.115075 -2.063167 1.429768
C  4.054189 0.344758 0.077253
C  2.692617 0.80639 0.470831
C  2.859697 -0.06959 -0.761608
C  4.988456 1.324369 -0.595007
C  4.780284 -0.646518 0.954742
C  2.22364 2.20832 0.325593
C  2.230861 -1.40366 -0.848022
C  0.964681 2.549358 0.043325
C  0.547906 3.983889 -0.074638
C  -0.127042 1.550544 -0.187172
C  1.225469 -3.143525 0.405185
C  -0.188689 -2.694512 0.526574
C  -1.075695 -2.266072 -0.512987
C  -0.883764 -2.541257 1.678312
C  -2.226879 -1.893877 0.093109
C  -3.503486 -1.329527 -0.421563
C  -3.599789 0.170734 -0.263046
C  -3.764731 0.747335 0.993487
C  -3.513811 1.003676 -1.372097
C  -3.83597 2.124356 1.134706
C  -3.588674 2.382351 -1.234936
C  -3.746751 2.94762 0.020437
H  2.276583 0.276791 1.323603
H  2.782316 0.448494 -1.710345
H  5.719405 0.797026 -1.210163
H  5.53881 1.904266 0.148919
H  4.46112 2.027862 -1.239223
H  4.108508 -1.293881 1.511179
H  5.397123 -0.110266 1.678476
H  5.444711 -1.278878 0.36289
H  2.954311 2.996042 0.486707
H  -0.235892 4.222967 0.648217
H  1.378762 4.670039 0.08652
H  0.127785 4.187519 -1.062987
H  -0.466278 1.581456 -1.225266
H  0.165058 0.526592 0.033144
H  -1.00293 1.782365 0.42209
H  1.533247 -3.68639 1.29837
H  1.364825 -3.797988 -0.455652
H  -0.865218 -2.235074 -1.569114
H  -0.636149 -2.735255 2.709816
H  -4.347692 -1.811368 0.080209
H  -3.583963 -1.591458 -1.477485
H  -3.836172 0.115602 1.870231
H  -3.384581 0.570411 -2.356896
H  -3.96401 2.556922 2.118479
H  -3.521238 3.014195 -2.110967
H  -3.804506 4.022438 0.131151
totalener: -1079.72818711 hartree
nucrepener: 2221.28958085 hartree
electener: -3301.01776796 hartree
oneelecener: -5880.94735874 hartree
twoeener: 2579.92959077 hartree
kineticenergy: 1074.91091433 hartree
xcener: -106.468809739122 hartree
chargesum: -0.0000000
charge: -0.267182 -0.376033 -0.259104 0.146840 -0.004013 -0.096214 -0.280542 -0.256440 -0.252253 0.329310 0.033466 -0.229977 -0.191608 0.025777 -0.047259 -0.287901 -0.024920 0.248753 -0.122253 0.074622 -0.160474 -0.182098 -0.111155 -0.094601 -0.158948 0.093976 0.083477 0.093347 0.088868 0.084893 0.088570 0.082052 0.090084 0.091143 0.085015 0.080759 0.084070 0.089895 0.046053 0.076626 0.090407 0.118531 0.148923 0.134264 0.110234 0.090770 0.111869 0.107340 0.124278 0.124767 0.123997
qa: -0.2672 -0.3760 -0.2591 0.1468 -0.0040 -0.0962 -0.2805 -0.2564 -0.2523 0.3293 0.0335 -0.2300 -0.1916 0.0258 -0.0473 -0.2879 -0.0249 0.2488 -0.1223 0.0746 -0.1605 -0.1821 -0.1112 -0.0946 -0.1589 0.0940 0.0835 0.0933 0.0889 0.0849 0.0886 0.0821 0.0901 0.0911 0.0850 0.0808 0.0841 0.0899 0.0461 0.0766 0.0904 0.1185 0.1489 0.1343 0.1102 0.0908 0.1119 0.1073 0.1243 0.1248 0.1240
va: 2.0824 2.1278 2.3011 3.7183 3.7950 3.8212 3.9172 3.8936 3.8858 4.2127 3.7519 3.9426 3.9563 3.9249 3.6895 3.9944 3.9842 3.5715 3.8636 3.6312 3.9826 3.9551 3.9169 3.8983 3.9401 1.0288 1.0316 1.0054 1.0008 1.0051 1.0191 1.0027 1.0027 1.0100 1.0000 1.0115 0.9990 1.0009 1.0356 1.0045 0.9997 1.0065 1.0237 1.0071 1.0057 1.0152 1.0236 1.0117 1.0012 1.0000 1.0020
dispcorr: -0.028546393 hartree
energy: -1079.756733502418
dipole: 12.73327 -12.93088 -0.19761 16.29988 -16.00154 0.29834 0.16364 0.45482 0.61845
magnitude: 0.71452 au
magnitude: 1.81618 debye
