program: Orca
programVersion: 5.0.2
elementType: O O O C C C C C C C C C C C C C C C C C C C C C C H H H H H H H H H H H H H H H H H H H H H H H H H H
charge: 0
multiplicity: 1
keywords: wb97x-d3
keywords: def2-TZVPP
keywords: def2/J RIJCOSX
keywords: DEFGRID2
keywords: scfconv7
keywords: smallprint printgap noloewdin
keywords: NOSOSCF
formula: C22H26O3
InChI: InChI=1/C22H26O3/c1-15(2)10-19-20(22(19,3)4)21(23)25-14-17-12-18(24-13-17)11-16-8-6-5-7-9-16/h5-10,12-13,19-20H,11,14H2,1-4H3
51 atoms
O  1.040062 -1.043386 0.135638
O  2.915287 -0.783805 1.322491
O  -2.573672 -3.530402 0.10343
C  4.06373 0.011097 -1.490468
C  3.833912 1.237432 -0.65797
C  2.713898 0.235097 -0.833503
C  4.097594 0.130975 -2.99562
C  5.011409 -1.041823 -0.968344
C  3.707192 2.584434 -1.245708
C  2.270866 -0.566477 0.328816
C  4.34656 3.690501 -0.858253
C  4.114689 4.996801 -1.557816
C  5.332876 3.755554 0.267966
C  0.496936 -1.862267 1.17493
C  -0.86654 -2.276829 0.763575
C  -2.040024 -1.461596 0.681986
C  -1.260839 -3.517517 0.398232
C  -3.04277 -2.274992 0.277396
C  -4.487118 -2.043932 -0.002635
C  -4.927628 -0.686064 0.471716
C  -5.07615 0.370275 -0.417847
C  -5.163909 -0.459567 1.824492
C  -5.45598 1.627763 0.030904
C  -5.542565 0.793681 2.276967
C  -5.690034 1.842611 1.379689
H  4.297105 1.19168 0.321475
H  1.916282 0.513637 -1.513657
H  3.360672 0.831336 -3.385831
H  3.903525 -0.838237 -3.458037
H  5.08042 0.468988 -3.328799
H  6.021566 -0.83095 -1.324877
H  4.734994 -2.032552 -1.335666
H  5.043593 -1.08427 0.117325
H  3.01906 2.675366 -2.081228
H  3.733824 5.751677 -0.865025
H  5.046094 5.394647 -1.96894
H  3.4011 4.904468 -2.375768
H  5.019474 4.491149 1.012926
H  5.475931 2.807578 0.781008
H  6.31028 4.081305 -0.096917
H  0.469953 -1.301108 2.112399
H  1.134865 -2.734194 1.340244
H  -2.120566 -0.409073 0.899705
H  -0.733552 -4.454088 0.311624
H  -5.081326 -2.822623 0.485428
H  -4.680854 -2.146352 -1.075121
H  -4.891605 0.209526 -1.4733
H  -5.043991 -1.273306 2.529977
H  -5.568715 2.439369 -0.67586
H  -5.723946 0.952762 3.331858
H  -5.987828 2.821471 1.731574
totalener: -1079.73379774 hartree
nucrepener: 2016.67519126 hartree
electener: -3096.40898900 hartree
oneelecener: -5471.50184143 hartree
twoeener: 2375.09285243 hartree
kineticenergy: 1074.90568451 hartree
xcener: -106.465565978596 hartree
chargesum: 0.0000000
charge: -0.250342 -0.392461 -0.256053 0.084768 0.050185 -0.087151 -0.242718 -0.260329 -0.186871 0.329662 -0.051310 -0.203192 -0.235955 0.057624 -0.045661 -0.224489 -0.029261 0.162976 -0.059885 0.011393 -0.140613 -0.165834 -0.123718 -0.115403 -0.128870 0.087813 0.072057 0.070214 0.090813 0.091457 0.085095 0.083872 0.100689 0.070910 0.084533 0.082714 0.076044 0.085159 0.083573 0.084804 0.101176 0.090587 0.139308 0.136147 0.101034 0.087647 0.108202 0.113619 0.124643 0.125536 0.125860
qa: -0.2503 -0.3925 -0.2561 0.0848 0.0502 -0.0872 -0.2427 -0.2603 -0.1869 0.3297 -0.0513 -0.2032 -0.2360 0.0576 -0.0457 -0.2245 -0.0293 0.1630 -0.0599 0.0114 -0.1406 -0.1658 -0.1237 -0.1154 -0.1289 0.0878 0.0721 0.0702 0.0908 0.0915 0.0851 0.0839 0.1007 0.0709 0.0845 0.0827 0.0760 0.0852 0.0836 0.0848 0.1012 0.0906 0.1393 0.1361 0.1010 0.0876 0.1082 0.1136 0.1246 0.1255 0.1259
va: 2.1306 2.1117 2.3014 3.7426 3.7631 3.9005 3.9157 3.9121 3.9004 4.2332 3.8217 3.9345 3.9461 3.8791 3.7588 3.9880 3.9758 3.6912 3.8549 3.6778 3.9750 3.9847 3.9631 3.9504 3.9565 1.0376 1.0366 1.0111 1.0044 1.0043 1.0010 1.0023 1.0221 1.0214 0.9983 0.9981 1.0122 0.9992 1.0158 0.9992 0.9945 1.0052 1.0097 1.0087 1.0066 1.0082 1.0115 1.0097 1.0006 1.0001 0.9998
dispcorr: -0.021043014 hartree
energy: -1079.754840758916
dipole: 25.86416 -26.23097 -0.36682 18.66859 -18.35748 0.31111 -9.42183 8.95179 -0.47004
magnitude: 0.67252 au
magnitude: 1.70942 debye
