program: Gaussian 09
title: 000071694
version: EM64L-G09RevD.01
frameworkgroup: C1[X(C16H23NO3)]
method: RPBEPBE
basis: SDD
operation: Freq
keyword: #p
keyword: freq=noraman
keyword: PBEPBE/SDD
title: #p freq=noraman PBEPBE/SDD
converged: YES YES NO NO
title: Mulliken charges:
elementType: O O O N C C C C C C C C C C C C C C C C H H H H H H H H H H H H H H H H H H H H H H H
charge: -0.306414 -0.222906 -0.385861 -0.135790 -0.043818 -0.000082 -0.479326 -0.496210 -0.334782 -0.742974 -0.723544 -0.417283 -0.277667 0.215460 0.105838 0.186600 -0.298153 -0.395608 -0.249905 -0.194036 0.227016 0.191195 0.225736 0.209154 0.217036 0.224177 0.196309 0.195748 0.223564 0.226677 0.218184 0.207132 0.224328 0.209832 0.211994 0.218548 0.236439 0.221408 0.272259 0.219517 0.233069 0.231832 0.355308
chargesum: 0.00000
title: Mulliken charges with hydrogens summed into heavy atoms:
elementType: O O O N C C C C C C C C C C C C C C C C
charge: -0.306414 -0.222906 -0.030554 -0.135790 0.183198 0.191112 -0.044437 -0.054997 0.057275 -0.074549 -0.082251 0.013259 0.180180 0.215460 0.105838 0.186600 -0.025894 -0.176090 -0.016837 0.037796
polarizability: 2.42009281e+02 4.47558536e+00 1.98921697e+02 3.90295599e+00 2.98220636e+00 1.33091341e+02
1716.lowfreq: -33.7516 -21.7972 -11.1610 -6.7839 -0.0002 0.0003 0.0006 7.7023 9.6905
frequency: -32.3385 -15.9580 6.8103 19.1737 35.3896 67.9023 87.5879 115.8794 130.9817 145.9354 156.0450 195.2187 219.4842 226.6137 248.1799 250.9465 257.6316 299.1753 306.0818 348.9203 376.3372 382.8517 404.1177 406.2923 436.9282 442.4822 490.6990 503.7679 524.6812 551.8229 624.6791 650.1435 653.5497 673.8094 721.6131 755.1813 755.5562 767.1570 776.3265 784.0538 829.3323 849.3334 851.0822 867.9323 871.1087 896.3647 922.9603 945.8613 955.2506 969.5867 986.9352 1007.8004 1011.9970 1032.9737 1041.8772 1047.9566 1064.8038 1097.8324 1098.9224 1107.7641 1120.4930 1129.8341 1150.4771 1159.1872 1173.6953 1174.6097 1195.0187 1206.2762 1215.8487 1219.8923 1228.1287 1253.3851 1272.5294 1280.8020 1290.4521 1294.7435 1301.1753 1319.5795 1330.2369 1335.8153 1341.8978 1359.9497 1369.2911 1378.7706 1385.7035 1395.0339 1428.9757 1454.9253 1459.8559 1462.9565 1468.5374 1471.1988 1473.0360 1475.0273 1482.4984 1489.3493 1493.6519 1593.5407 1607.3107 1631.8135 2848.5224 2873.0818 2972.7463 2974.7593 2987.7241 2993.4845 2998.7535 3003.3820 3004.7486 3019.1401 3051.3048 3057.1768 3065.4230 3067.6046 3068.1414 3072.6781 3080.6159 3084.2268 3112.3632 3142.6962 3162.3038 3183.8008 3548.1497
redmass: 2.3140 3.4476 4.8006 4.3970 8.3022 3.8665 4.4662 3.0813 4.0307 2.6956 3.8945 1.1871 1.5387 1.4736 5.6230 3.0552 2.2494 2.5931 3.5610 2.7406 2.8469 4.6795 1.3619 2.1277 3.0942 3.3383 4.0457 2.6876 3.4534 7.4581 3.4964 5.2459 2.4385 4.4046 2.6368 2.1873 1.9237 1.8831 2.6517 2.5585 3.2430 2.6244 1.4954 2.0205 3.3990 1.6054 1.4873 1.6674 1.3626 2.7008 1.3377 2.0475 2.2413 3.3397 2.2060 1.4690 2.0454 2.0293 1.9846 2.0166 2.3841 2.1046 2.3937 1.2253 1.5246 1.2336 1.5737 1.6288 1.5208 1.9517 1.6741 2.8796 1.3571 1.2067 1.1970 1.4513 1.4135 1.4964 1.3496 1.4070 1.3780 1.4315 1.2270 1.2669 1.4407 6.9832 2.3562 1.0790 1.0758 1.0557 1.0601 1.0635 1.0811 1.0467 1.0876 2.5525 1.0766 6.7762 6.6655 10.5808 1.0822 1.0700 1.0349 1.0355 1.0752 1.0657 1.0629 1.0810 1.0623 1.0656 1.1011 1.1033 1.1003 1.1010 1.1038 1.0996 1.1029 1.1022 1.0888 1.0895 1.0951 1.0969 1.0658
irintensity: 0.0215 0.0425 0.0389 0.1223 2.3375 1.7417 2.7587 1.8029 1.6601 0.7986 0.9858 0.6579 1.3762 1.4741 1.3847 3.4733 0.6573 2.4042 1.3455 4.8055 2.9970 6.8516 91.5540 29.1608 5.9570 5.7262 11.2824 8.8401 16.4869 6.0064 0.7336 5.0985 7.6894 20.4158 2.7662 18.0534 39.7725 34.7857 0.0838 5.8176 35.9465 3.5228 0.4448 8.7646 10.4146 0.9790 2.6544 2.1148 1.3537 10.6452 0.3026 68.9907 144.2862 195.8853 4.9136 6.5529 7.0394 59.3411 73.8506 12.0951 13.9179 0.1740 42.9773 56.9407 39.1954 7.7056 12.4353 10.9797 67.7706 222.5749 96.3813 10.1388 3.7021 2.3140 9.8657 57.0052 2.6917 1.8904 5.3073 20.5512 14.0924 4.1251 21.6276 24.3402 3.0844 14.7353 28.5308 6.8914 1.4436 5.4563 8.3496 5.1496 14.3224 15.2809 3.3243 22.9190 2.3267 27.1664 32.3388 253.2069 50.8141 127.8540 27.5243 24.9957 12.0802 20.1112 33.4652 14.3311 56.4494 49.5002 30.1133 3.8119 11.9567 94.0606 32.5059 52.5682 26.3881 66.3143 13.3815 11.0785 15.7329 7.7622 29.1184
temp: 298.150 k
press: 1.00000 atm
elementType: 8 8 8 7 6 6 6 6 6 6 6 6 6 6 6 6 6 6 6 6 1 1 1 1 1 1 1 1 1 1 1 1 1 1 1 1 1 1 1 1 1 1 1
symmnumber: 1
zpe: 948076.5 jmol-1
zpe.correction: 0.361103 hartree
zpe.thermalcorrener: 0.380152 hartree
zpe.thermalcorrenthalpy: 0.381097 hartree
zpe.thermalcorrgfe: 0.311119 hartree
zpe.sumelectzpe: -902.375449 hartree
zpe.sumelectthermal: -902.356400 hartree
zpe.sumelectthermalent: -902.355456 hartree
zpe.sumelectthermalfe: -902.425433 hartree
dipole: 0.7580 3.4263 0.0586
dipole: 3.5096
quadrupole: -95.6148 -121.6713 -121.3766
quadrupole: 10.5110 2.5609 1.9535
quadrupole: 17.2728 -8.7837 -8.4890 10.5110 2.5609 1.9535
hfenergy: -902.7365521 hartree
pointgroup: C01 [X(C16H23N1O3)]
dipole: -0.3270542 1.3406423 0.0482456 debye
polarizability: 242.1156989|-3.7776688|198.871381|4.5954588|0.6938443|133.0352387 unknown
InChI: InChI=1S/C16H23NO3/c1-12-8-9-13(2)17(12)10-5-11-20-16(19)14-6-3-4-7-15(14)18/h3-4,6-7,12-13,18H,5,8-11H2,1-2H3
charge 0 multiplicity 1
43 atoms
O  -0.862947 -0.989722 0.361455
O  -2.582862 -2.481876 -0.122591
O  -5.097517 -1.332429 -0.138709
N  3.429971 -0.303145 -0.009744
C  3.721431 0.409464 1.271296
C  4.120964 0.424946 -1.123344
C  5.213903 0.768089 1.07687
C  5.30985 1.162551 -0.425358
C  2.026293 -0.667611 -0.284231
C  2.845667 1.663616 1.553946
C  4.571663 -0.538535 -2.23939
C  1.449444 -1.622657 0.781676
C  0.06379 -2.157089 0.422254
C  -2.204414 -1.30023 0.050059
C  -3.023685 -0.05751 -0.048567
C  -4.447184 -0.097895 -0.163778
C  -2.388549 1.216148 -0.053823
C  -5.186903 1.107134 -0.287686
C  -3.121711 2.41084 -0.177899
C  -4.530752 2.352396 -0.297385
H  3.597648 -0.298716 2.113335
H  3.434915 1.184814 -1.575797
H  5.832204 -0.124504 1.277924
H  5.542838 1.576409 1.753647
H  5.214055 2.25569 -0.55309
H  6.278468 0.864124 -0.863434
H  1.36061 0.226042 -0.376221
H  1.996479 -1.182182 -1.264662
H  2.971161 2.432779 0.769275
H  1.771594 1.406772 1.611846
H  3.133674 2.113352 2.522218
H  5.069138 0.017882 -3.056069
H  5.280001 -1.282196 -1.83226
H  3.71721 -1.085524 -2.679108
H  2.135863 -2.485247 0.890091
H  1.397029 -1.121347 1.766623
H  -0.318325 -2.867957 1.177267
H  0.050965 -2.663094 -0.561835
H  -1.29994 1.239533 0.03817
H  -6.280652 1.061569 -0.375526
H  -2.605072 3.37552 -0.183843
H  -5.117143 3.272288 -0.396924
H  -6.077873 -1.20529 -0.214179
