program: Orca
programVersion: 5.0.2
elementType: O O O C C C C C C C C C C C C C C C C C C C C C C H H H H H H H H H H H H H H H H H H H H H H H H H H
charge: 0
multiplicity: 1
keywords: wb97x-d3
keywords: def2-TZVPP
keywords: def2/J RIJCOSX
keywords: DEFGRID2
keywords: scfconv7
keywords: smallprint printgap noloewdin
keywords: NOSOSCF
formula: C22H26O3
InChI: InChI=1/C22H26O3/c1-15(2)10-19-20(22(19,3)4)21(23)25-14-17-12-18(24-13-17)11-16-8-6-5-7-9-16/h5-10,12-13,19-20H,11,14H2,1-4H3
51 atoms
O  0.940925 -1.098017 0.252217
O  2.767364 -0.901181 1.52473
O  -2.666371 -3.581777 -0.091126
C  3.962049 0.226675 -1.150741
C  3.667394 1.347466 -0.199518
C  2.588215 0.343819 -0.51179
C  4.028001 0.540189 -2.62559
C  4.921277 -0.859058 -0.72905
C  3.521273 2.751009 -0.660255
C  2.144891 -0.599313 0.539343
C  4.502539 3.653902 -0.678515
C  4.265481 5.058856 -1.142989
C  5.904024 3.353887 -0.241494
C  0.403335 -2.051861 1.172479
C  -0.956483 -2.416045 0.706563
C  -2.117707 -1.580223 0.677398
C  -1.359217 -3.614052 0.226747
C  -3.122421 -2.339438 0.182516
C  -4.556978 -2.064723 -0.109288
C  -4.93874 -0.666345 0.290889
C  -5.591541 -0.422473 1.492779
C  -4.611884 0.413355 -0.523632
C  -5.915961 0.871362 1.874168
C  -4.929469 1.707988 -0.144375
C  -5.584115 1.940591 1.056693
H  4.103718 1.221613 0.787537
H  1.799976 0.666645 -1.183953
H  3.842017 -0.356659 -3.219106
H  5.017672 0.918104 -2.88971
H  3.30391 1.296511 -2.925713
H  4.914733 -1.038569 0.342983
H  5.937434 -0.579784 -1.015137
H  4.689085 -1.801418 -1.229586
H  2.536174 3.05618 -1.00185
H  3.235491 5.217831 -1.460129
H  4.486791 5.77787 -0.350054
H  4.919068 5.310821 -1.981922
H  6.047303 2.314535 0.047158
H  6.612682 3.576027 -1.04325
H  6.190769 3.981202 0.606506
H  0.371261 -1.621224 2.17625
H  1.0481 -2.933204 1.220062
H  -2.187064 -0.549632 0.984721
H  -0.841599 -4.546218 0.065572
H  -5.186383 -2.789529 0.41581
H  -4.750949 -2.215559 -1.176496
H  -5.847786 -1.252994 2.139671
H  -4.098273 0.237604 -1.461447
H  -6.427775 1.043051 2.812026
H  -4.668015 2.536866 -0.789022
H  -5.835468 2.950514 1.35266
totalener: -1079.73298087 hartree
nucrepener: 2025.19636834 hartree
electener: -3104.92934921 hartree
oneelecener: -5488.55035118 hartree
twoeener: 2383.62100197 hartree
kineticenergy: 1074.91058386 hartree
xcener: -106.465378517349 hartree
chargesum: 0.0000000
charge: -0.252292 -0.391138 -0.256395 0.110524 -0.025647 -0.105167 -0.236437 -0.277343 -0.183903 0.336741 -0.031269 -0.212066 -0.233173 0.057033 -0.047448 -0.221886 -0.029863 0.162045 -0.053786 0.024466 -0.148389 -0.180199 -0.121736 -0.115352 -0.129592 0.103084 0.076654 0.092194 0.086032 0.078196 0.105592 0.082362 0.087538 0.088053 0.078238 0.086313 0.083199 0.081097 0.083503 0.092910 0.103250 0.090385 0.139370 0.136068 0.088868 0.097840 0.108727 0.116215 0.125065 0.125796 0.125724
qa: -0.2523 -0.3911 -0.2564 0.1105 -0.0256 -0.1052 -0.2364 -0.2773 -0.1839 0.3367 -0.0313 -0.2121 -0.2332 0.0570 -0.0474 -0.2219 -0.0299 0.1620 -0.0538 0.0245 -0.1484 -0.1802 -0.1217 -0.1154 -0.1296 0.1031 0.0767 0.0922 0.0860 0.0782 0.1056 0.0824 0.0875 0.0881 0.0782 0.0863 0.0832 0.0811 0.0835 0.0929 0.1033 0.0904 0.1394 0.1361 0.0889 0.0978 0.1087 0.1162 0.1251 0.1258 0.1257
va: 2.1315 2.1130 2.3006 3.7101 3.7961 3.9327 3.9049 3.9062 3.8613 4.2356 3.7387 3.9407 3.9417 3.8772 3.7666 3.9899 3.9768 3.7101 3.8673 3.6662 3.9905 3.9795 3.9625 3.9496 3.9582 1.0269 1.0354 1.0054 1.0048 1.0080 1.0208 1.0021 1.0027 1.0141 1.0109 0.9976 0.9988 1.0117 1.0001 1.0010 0.9948 1.0044 1.0098 1.0088 1.0115 1.0040 1.0113 1.0096 1.0006 1.0000 0.9998
dispcorr: -0.021824506 hartree
energy: -1079.754805376231
dipole: 27.36720 -27.64964 -0.28244 19.18371 -18.81145 0.37226 -9.08598 8.54923 -0.53674
magnitude: 0.71165 au
magnitude: 1.80887 debye
