program: Orca
programVersion: 5.0.2
elementType: O O O C C C C C C C C C C C C C C C C C C C C C C H H H H H H H H H H H H H H H H H H H H H H H H H H
charge: 0
multiplicity: 1
keywords: wb97x-d3
keywords: def2-TZVPP
keywords: def2/J RIJCOSX
keywords: DEFGRID2
keywords: scfconv7
keywords: smallprint printgap noloewdin
keywords: NOSOSCF
formula: C22H26O3
InChI: InChI=1/C22H26O3/c1-15(2)10-19-20(22(19,3)4)21(23)25-14-17-12-18(24-13-17)11-16-8-6-5-7-9-16/h5-10,12-13,19-20H,11,14H2,1-4H3
51 atoms
O  1.684824 -1.945752 -0.296076
O  0.877909 -0.722666 -1.988425
O  -2.292428 -2.673363 1.300237
C  1.714936 1.499812 0.148102
C  2.495121 1.588756 -1.122363
C  2.388112 0.259106 -0.418114
C  2.3183 2.039126 1.422296
C  0.212671 1.640193 0.093065
C  3.796864 2.299044 -1.215012
C  1.571407 -0.822925 -1.008499
C  4.783034 1.969094 -2.050096
C  6.05313 2.761573 -2.11815
C  4.706269 0.800674 -2.984612
C  0.801303 -3.025056 -0.619765
C  -0.568739 -2.775028 -0.094185
C  -1.634748 -2.052511 -0.718991
C  -1.03823 -3.124047 1.12733
C  -2.649468 -2.017695 0.17419
C  -3.969938 -1.335039 0.168966
C  -3.934433 -0.063385 0.98447
C  -4.305145 -0.062144 2.323654
C  -3.476973 1.120445 0.415206
C  -4.22269 1.098818 3.079059
C  -3.395642 2.282709 1.165564
C  -3.768177 2.274832 2.502259
H  1.879195 1.649042 -2.016559
H  3.256932 -0.078637 0.13645
H  2.118762 3.108296 1.522672
H  3.398452 1.898173 1.465795
H  1.883538 1.54044 2.290091
H  -0.270046 1.088304 0.901225
H  -0.208418 1.286872 -0.845805
H  -0.06334 2.69078 0.204239
H  3.928463 3.169891 -0.578934
H  6.204921 3.174045 -3.11884
H  6.058943 3.589843 -1.410561
H  6.921391 2.132072 -1.907402
H  5.510387 0.088575 -2.780943
H  3.761133 0.265669 -2.922318
H  4.837338 1.126404 -4.019722
H  1.245829 -3.897301 -0.141844
H  0.785383 -3.199753 -1.696528
H  -1.622963 -1.60555 -1.698692
H  -0.603885 -3.676326 1.945326
H  -4.7469 -2.005016 0.546174
H  -4.229469 -1.10862 -0.866474
H  -4.659399 -0.977554 2.782176
H  -3.174218 1.131832 -0.625591
H  -4.513786 1.084052 4.121393
H  -3.039969 3.195527 0.705353
H  -3.70579 3.181066 3.090196
totalener: -1079.73086756 hartree
nucrepener: 2157.69920893 hartree
electener: -3237.43007649 hartree
oneelecener: -5753.90293549 hartree
twoeener: 2516.47285900 hartree
kineticenergy: 1074.91456715 hartree
xcener: -106.466855832817 hartree
chargesum: 0.0000000
charge: -0.256617 -0.396862 -0.250763 0.160948 -0.026353 -0.106828 -0.282954 -0.274932 -0.237495 0.352239 -0.005093 -0.212327 -0.225375 0.044645 -0.050738 -0.289354 -0.033235 0.237622 -0.130780 0.130398 -0.166940 -0.216873 -0.115641 -0.119969 -0.132666 0.103952 0.082163 0.090012 0.084036 0.094199 0.101416 0.085034 0.083001 0.092882 0.086494 0.078122 0.084019 0.084208 0.080771 0.087961 0.098695 0.112828 0.142429 0.134540 0.103067 0.104279 0.107923 0.111621 0.123314 0.125026 0.123953
qa: -0.2566 -0.3969 -0.2508 0.1609 -0.0264 -0.1068 -0.2830 -0.2749 -0.2375 0.3522 -0.0051 -0.2123 -0.2254 0.0446 -0.0507 -0.2894 -0.0332 0.2376 -0.1308 0.1304 -0.1669 -0.2169 -0.1156 -0.1200 -0.1327 0.1040 0.0822 0.0900 0.0840 0.0942 0.1014 0.0850 0.0830 0.0929 0.0865 0.0781 0.0840 0.0842 0.0808 0.0880 0.0987 0.1128 0.1424 0.1345 0.1031 0.1043 0.1079 0.1116 0.1233 0.1250 0.1240
va: 2.1319 2.0987 2.3081 3.7821 3.8285 3.8250 3.9026 3.8993 3.8992 4.2035 3.7337 3.9418 3.9413 3.9066 3.6953 4.0093 3.9973 3.5860 3.8799 3.5561 4.0272 3.9829 3.9529 3.9238 3.9649 1.0265 1.0328 1.0006 1.0047 1.0062 0.9937 1.0185 1.0041 1.0093 0.9983 1.0098 0.9990 1.0007 1.0233 1.0019 0.9970 1.0050 1.0256 1.0068 1.0121 1.0104 1.0145 1.0105 1.0000 0.9999 0.9995
dispcorr: -0.025677639 hartree
energy: -1079.756545200040
dipole: 19.66510 -19.41516 0.24994 16.89382 -16.90842 -0.01460 -4.22238 4.62740 0.40502
magnitude: 0.47616 au
magnitude: 1.21030 debye
